18 pass, 2 fail - View results on dispatcher

182Entity.Entity
1Entity.Drupal\Tests\entity\Functional\RevisionRouteAccessTest
- testRevisionRouteAccess
1Entity.Drupal\Tests\entity\Functional\DeleteMultipleFormTest
- testForm
3Entity.Drupal\Tests\entity\Kernel\RevisionBasicUITest
- testRevisionHistory
- testRevisionView
- testRevisionRevert
1Entity.Drupal\Tests\entity\Kernel\DeleteActionTest
- testAction
2Entity.Drupal\Tests\entity\Unit\EntityPermissionProviderTest
Drupal\Tests\entity\Unit\EntityPermissionProviderTest
exception: [Other] Line 0 of sites/default/files/simpletest/phpunit-5.xml:
PHPunit Test failed to complete; Error: PHPUnit 4.8.35 by Sebastian Bergmann and contributors.

Testing Drupal\Tests\entity\Unit\EntityPermissionProviderTest
EEEE

Time: 224 ms, Memory: 5.00MB

There were 4 errors:

1) Drupal\Tests\entity\Unit\EntityPermissionProviderTest::testBuildPermissions with data set #0 (Double\ContentEntityTypeInterface\P1 Object (...), array('Administer green entities', 'Access the green entities ove...w page', 'View green entities', 'Create green entities', 'Update green entities', 'Delete green entities'))
Prophecy\Exception\Call\UnexpectedCallException: Method call:
  - entityClassImplements("Drupal\user\EntityOwnerInterface")
on Double\ContentEntityTypeInterface\P1 was not expected, expected calls were:
  - getProvider()
  - id()
  - getSingularLabel()
  - getPluralLabel()
  - isSubclassOf(exact("Drupal\user\EntityOwnerInterface"))
  - getPermissionGranularity()

/var/www/html/modules/contrib/entity/src/EntityPermissionProvider.php:66
/var/www/html/modules/contrib/entity/tests/src/Unit/EntityPermissionProviderTest.php:49

2) Drupal\Tests\entity\Unit\EntityPermissionProviderTest::testBuildPermissions with data set #1 (Double\ContentEntityTypeInterface\P2 Object (...), array('Administer blue entities', 'Access the blue entities overview page', 'View any blue entity', 'View own blue entities', 'Create blue entities', 'Update any blue entity', 'Update own blue entities', 'Delete any blue entity', 'Delete own blue entities'))
Prophecy\Exception\Call\UnexpectedCallException: Method call:
  - entityClassImplements("Drupal\user\EntityOwnerInterface")
on Double\ContentEntityTypeInterface\P2 was not expected, expected calls were:
  - getProvider()
  - id()
  - getSingularLabel()
  - getPluralLabel()
  - isSubclassOf(exact("Drupal\user\EntityOwnerInterface"))
  - getPermissionGranularity()

/var/www/html/modules/contrib/entity/src/EntityPermissionProvider.php:66
/var/www/html/modules/contrib/entity/tests/src/Unit/EntityPermissionProviderTest.php:49

3) Drupal\Tests\entity\Unit\EntityPermissionProviderTest::testBuildPermissions with data set #2 (Double\ContentEntityTypeInterface\P3 Object (...), array('Administer white entities', 'Access the white entities ove...w page', 'View white entities', 'First: Create white entities', 'First: Update white entities', 'First: Delete white entities', 'Second: Create white entities', 'Second: Update white entities', 'Second: Delete white entities'))
Prophecy\Exception\Call\UnexpectedCallException: Method call:
  - entityClassImplements("Drupal\user\EntityOwnerInterface")
on Double\ContentEntityTypeInterface\P3 was not expected, expected calls were:
  - getProvider()
  - id()
  - getSingularLabel()
  - getPluralLabel()
  - isSubclassOf(exact("Drupal\user\EntityOwnerInterface"))
  - getPermissionGranularity()

/var/www/html/modules/contrib/entity/src/EntityPermissionProvider.php:66
/var/www/html/modules/contrib/entity/tests/src/Unit/EntityPermissionProviderTest.php:49

4) Drupal\Tests\entity\Unit\EntityPermissionProviderTest::testBuildPermissions with data set #3 (Double\ContentEntityTypeInterface\P4 Object (...), array('Administer black entities', 'Access the black entities ove...w page', 'View any black entity', 'View own black entities', 'Third: Create black entities', 'Third: Update any black entity', 'Third: Update own black entities', 'Third: Delete any black entity', 'Third: Delete own black entities'))
Prophecy\Exception\Call\UnexpectedCallException: Method call:
  - entityClassImplements("Drupal\user\EntityOwnerInterface")
on Double\ContentEntityTypeInterface\P4 was not expected, expected calls were:
  - getProvider()
  - id()
  - getSingularLabel()
  - getPluralLabel()
  - isSubclassOf(exact("Drupal\user\EntityOwnerInterface"))
  - getPermissionGranularity()

/var/www/html/modules/contrib/entity/src/EntityPermissionProvider.php:66
/var/www/html/modules/contrib/entity/tests/src/Unit/EntityPermissionProviderTest.php:49

FAILURES!
Tests: 4, Assertions: 0, Errors: 4.
Unknown
fail: [run-tests.sh check] Line 0 of :
FATAL Drupal\Tests\entity\Unit\EntityPermissionProviderTest: test runner returned a non-zero error code (2).
12Entity.Drupal\Tests\entity\Unit\EntityAccessControlHandlerTest
- testAccess with data set #0
- testAccess with data set #1
- testAccess with data set #2
- testAccess with data set #3
- testAccess with data set #4
- testAccess with data set #5
- testAccess with data set #6
- testAccess with data set #7
- testCreateAccess with data set #0
- testCreateAccess with data set #1
- testCreateAccess with data set #2
- testCreateAccess with data set #3

41 coding standards messages

Outdated coding standards messages are not available.

History

UpdatedResult
19 Sep 2017 at 13:56 UTC
19 Sep 2017 at 13:53 UTC
19 Sep 2017 at 13:51 UTC
18 Sep 2017 at 17:35 UTC
18 Sep 2017 at 10:31 UTC
12 Sep 2017 at 14:17 UTC
5 Sep 2017 at 22:53 UTC
5 Sep 2017 at 22:51 UTC
5 Sep 2017 at 22:50 UTC
5 Sep 2017 at 22:49 UTC
8 Mar 2017 at 21:14 UTC
8 Mar 2017 at 21:13 UTC
14 Feb 2017 at 11:06 UTC
12 Oct 2016 at 10:14 UTC
23 Sep 2016 at 13:10 UTC
23 Jun 2016 at 14:23 UTC
4 May 2016 at 16:30 UTC
27 Apr 2016 at 09:06 UTC
26 Apr 2016 at 16:23 UTC
25 Apr 2016 at 17:11 UTC
6 Apr 2016 at 11:46 UTC