11 pass, 4 fail - No results available yet.

114Simplesamlphp_auth.Simplesamlphp_auth
2Simplesamlphp_auth.Drupal\simplesamlphp_auth\Tests\SimplesamlphpAuthTest
testConfig
fail: [Completion check] Line 58 of modules/contrib/simplesamlphp_auth/src/Tests/SimplesamlphpAuthTest.php:
The test did not complete due to a fatal error.
onConfigSave
exception: [Uncaught exception] Line 95 of core/lib/Drupal/Core/Config/Development/ConfigSchemaChecker.php:
Drupal\Core\Config\Schema\SchemaIncompleteException: Schema errors for simplesamlphp_auth.settings with the following errors: simplesamlphp_auth.settings:header_no_cache missing schema, simplesamlphp_auth.settings:_core missing schema in Drupal\Core\Config\Development\ConfigSchemaChecker->onConfigSave() (line 95 of /var/www/html/core/lib/Drupal/Core/Config/Development/ConfigSchemaChecker.php). Drupal\Core\Config\Development\ConfigSchemaChecker->onConfigSave(Object, 'config.save', Object) (Line: 108)
Drupal\Component\EventDispatcher\ContainerAwareEventDispatcher->dispatch('config.save', Object) (Line: 227)
Drupal\Core\Config\Config->save(1) (Line: 334)
Drupal\Core\Config\ConfigInstaller->createConfiguration('', Array) (Line: 134)
Drupal\Core\Config\ConfigInstaller->installDefaultConfig('module', 'simplesamlphp_auth') (Line: 75)
Drupal\Core\ProxyClass\Config\ConfigInstaller->installDefaultConfig('module', 'simplesamlphp_auth') (Line: 248)
Drupal\Core\Extension\ModuleInstaller->install(Array, 1) (Line: 83)
Drupal\Core\ProxyClass\Extension\ModuleInstaller->install(Array, 1) (Line: 419)
Drupal\simpletest\WebTestBase->installModulesFromClassProperty(Object) (Line: 383)
Drupal\simpletest\WebTestBase->setUp() (Line: 37)
Drupal\simplesamlphp_auth\Tests\SimplesamlphpAuthTest->setUp() (Line: 949)
Drupal\simpletest\TestBase->run(Array) (Line: 793)
simpletest_script_run_one_test('1', 'Drupal\simplesamlphp_auth\Tests\SimplesamlphpAuthTest') (Line: 67)
11Simplesamlphp_auth.Drupal\Tests\simplesamlphp_auth\Unit\Service\SimplesamlphpDrupalAuthTest
- testExternalLoginRegister
- testExternalLoginWithRoleMatch
- testExternalRegister
- testExternalRegisterWithAutoEnableSaml
- testSynchronizeUserAttributes
- testRoleMatching with data set #0
- testRoleMatching with data set #1
- testRoleMatching with data set #2
- testRoleMatching with data set #3
- testRoleMatching with data set #4
- testRoleMatching with data set #5
2Simplesamlphp_auth.Drupal\Tests\simplesamlphp_auth\Unit\Service\SimplesamlphpAuthManagerTest
Drupal\Tests\simplesamlphp_auth\Unit\Service\SimplesamlphpAuthManagerTest
exception: [Other] Line 0 of sites/default/files/simpletest/phpunit-3.xml:
PHPunit Test failed to complete; Error: PHPUnit 4.8.35 by Sebastian Bergmann and contributors.

Testing Drupal\Tests\simplesamlphp_auth\Unit\Service\SimplesamlphpAuthManagerTest
..E.....

Time: 149 ms, Memory: 4.00MB

There was 1 error:

1) Drupal\Tests\simplesamlphp_auth\Unit\Service\SimplesamlphpAuthManagerTest::testExternalAuthenticate
Drupal\Core\DependencyInjection\ContainerNotInitializedException: \Drupal::$container is not initialized yet. \Drupal::setContainer() must be called with a real container.

/var/www/html/core/lib/Drupal.php:129
/var/www/html/core/lib/Drupal.php:228
/var/www/html/modules/contrib/simplesamlphp_auth/src/Service/SimplesamlphpAuthManager.php:77
/var/www/html/modules/contrib/simplesamlphp_auth/tests/src/Unit/Service/SimplesamlphpAuthManagerTest.php:141

FAILURES!
Tests: 8, Assertions: 13, Errors: 1.
Unknown
fail: [run-tests.sh check] Line 0 of :
FATAL Drupal\Tests\simplesamlphp_auth\Unit\Service\SimplesamlphpAuthManagerTest: test runner returned a non-zero error code (2).

History

UpdatedResult
16 Feb 2018 at 15:31 UTC
25 Jan 2018 at 09:32 UTC
12 Jan 2018 at 10:00 UTC
12 Jan 2018 at 09:49 UTC
12 Jan 2018 at 09:44 UTC
13 Dec 2017 at 16:57 UTC
12 Dec 2017 at 22:12 UTC
5 Dec 2017 at 09:55 UTC
27 Nov 2017 at 09:41 UTC
12 Jun 2017 at 18:49 UTC
11 May 2017 at 18:32 UTC
11 May 2017 at 16:23 UTC
24 Mar 2017 at 08:47 UTC
23 Mar 2017 at 12:13 UTC
23 Mar 2017 at 11:16 UTC
18 Mar 2017 at 21:01 UTC
16 Mar 2017 at 11:55 UTC
16 Mar 2017 at 10:01 UTC
20 Jan 2017 at 09:01 UTC
20 Jan 2017 at 09:02 UTC
21 Jul 2016 at 10:16 UTC
2 Mar 2016 at 16:19 UTC
1 Feb 2016 at 10:21 UTC
1 Feb 2016 at 10:07 UTC
1 Feb 2016 at 09:17 UTC
1 Feb 2016 at 09:16 UTC
20 Jan 2016 at 16:50 UTC
20 Jan 2016 at 16:39 UTC
20 Jan 2016 at 15:40 UTC
20 Jan 2016 at 15:37 UTC
20 Jan 2016 at 15:34 UTC
20 Jan 2016 at 15:34 UTC
20 Jan 2016 at 15:32 UTC
20 Jan 2016 at 15:32 UTC
20 Jan 2016 at 15:29 UTC
19 Jan 2016 at 15:33 UTC
19 Jan 2016 at 15:18 UTC
18 Jan 2016 at 17:30 UTC
18 Jan 2016 at 16:56 UTC
18 Jan 2016 at 10:06 UTC
18 Jan 2016 at 08:05 UTC
16 Jan 2016 at 18:38 UTC
15 Jan 2016 at 13:08 UTC
15 Jan 2016 at 12:28 UTC
15 Jan 2016 at 12:24 UTC