20,976 pass, 101 fail - View results on dispatcher

9720Aggregator.Aggregator
51Aggregator.Drupal\aggregator\Tests\AddFeedTest
Drupal\Core\Test\HttpClientMiddleware\{closure}
exception: [Uncaught exception] Line 44 of core/lib/Drupal/Core/Test/HttpClientMiddleware/TestHttpClientMiddleware.php:
Exception: Warning: DOMDocument::loadXML(): XML declaration allowed only at the start of the document in Entity, line: 6
Drupal\Core\EventSubscriber\RssResponseRelativeUrlFilter->transformRootRelativeUrlsToAbsolute()() (Line: 47)
 in Drupal\Core\Test\HttpClientMiddleware\TestHttpClientMiddleware->Drupal\Core\Test\HttpClientMiddleware\{closure}() (line 44 of /var/www/html/core/lib/Drupal/Core/Test/HttpClientMiddleware/TestHttpClientMiddleware.php). Drupal\Core\Test\HttpClientMiddleware\TestHttpClientMiddleware->Drupal\Core\Test\HttpClientMiddleware\{closure}(Object) (Line: 39)
GuzzleHttp\Promise\FulfilledPromise::GuzzleHttp\Promise\{closure}() (Line: 61)
GuzzleHttp\Promise\TaskQueue->run(1) (Line: 246)
GuzzleHttp\Promise\Promise->invokeWaitFn() (Line: 223)
GuzzleHttp\Promise\Promise->waitIfPending() (Line: 266)
GuzzleHttp\Promise\Promise->invokeWaitList() (Line: 225)
GuzzleHttp\Promise\Promise->waitIfPending() (Line: 62)
GuzzleHttp\Promise\Promise->wait() (Line: 104)
GuzzleHttp\Client->send(Object) (Line: 91)
Drupal\aggregator\Plugin\aggregator\fetcher\DefaultFetcher->fetch(Object) (Line: 90)
Drupal\aggregator\ItemsImporter->refresh(Object) (Line: 77)
Drupal\aggregator\Entity\Feed->refreshItems() (Line: 23)
Drupal\aggregator\Tests\AddFeedTest->testAddFeed() (Line: 1060)
Drupal\simpletest\TestBase->run(Array) (Line: 752)
simpletest_script_run_one_test('24', 'Drupal\aggregator\Tests\AddFeedTest') (Line: 66)
- setUp
- createFeed
- deleteFeed
- testFeedLabelEscaping
- testAddLongFeed
41Aggregator.Drupal\aggregator\Tests\AggregatorCronTest
testCron
fail: [Other] Line 19 of core/modules/aggregator/src/Tests/AggregatorCronTest.php:
Value 5 is equal to value '0'.

fail: [Other] Line 23 of core/modules/aggregator/src/Tests/AggregatorCronTest.php:
Value 5 is equal to value '0'.

fail: [Other] Line 42 of core/modules/aggregator/src/Tests/AggregatorCronTest.php:
Value 5 is equal to value '0'.
- setUp
- createSampleNodes
- createFeed
- deleteFeedItems
34Aggregator.Drupal\aggregator\Tests\AggregatorRenderingTest
testBlockLinks
fail: [Completion check] Line 31 of core/modules/aggregator/src/Tests/AggregatorRenderingTest.php:
The test did not complete due to a fatal error.

fail: [Other] Line 55 of core/modules/aggregator/src/Tests/AggregatorRenderingTest.php:
Feed block is displayed on the page.
transformRootRelativeUrlsToAbsolute
exception: [Warning] Line 47 of core/lib/Drupal/Core/EventSubscriber/RssResponseRelativeUrlFilter.php:
DOMDocument::loadXML(): XML declaration allowed only at the start of the document in Entity, line: 6
updateFeedItems
fail: [Other] Line 187 of core/modules/aggregator/src/Tests/AggregatorTestBase.php:
Total items in feed equal to the total items in database (5 != 0)
Value '5' is equal to value 0.
nkno
fail: [run-tests.sh check] Line 0 of :
FATAL Drupal\aggregator\Tests\AggregatorRenderingTest: test runner returned a non-zero error code (255).
- setUp
- createSampleNodes
- createFeed
43Aggregator.Drupal\aggregator\Tests\FeedAdminDisplayTest
testFeedUpdateFields
fail: [Other] Line 34 of core/modules/aggregator/src/Tests/FeedAdminDisplayTest.php:
The scheduled feed has been updated. Last updated changed.

fail: [Other] Line 35 of core/modules/aggregator/src/Tests/FeedAdminDisplayTest.php:
The scheduled feed has been updated. Next update changed.

fail: [Other] Line 36 of core/modules/aggregator/src/Tests/FeedAdminDisplayTest.php:
The scheduled feed been updated.  Last update shows "x x ago".

fail: [Other] Line 37 of core/modules/aggregator/src/Tests/FeedAdminDisplayTest.php:
The scheduled feed has been updated. Next update shows "x x left".

fail: [Other] Line 59 of core/modules/aggregator/src/Tests/FeedAdminDisplayTest.php:
The non scheduled feed has been updated. It shows "x x ago" as last update.
transformRootRelativeUrlsToAbsolute
exception: [Warning] Line 47 of core/lib/Drupal/Core/EventSubscriber/RssResponseRelativeUrlFilter.php:
DOMDocument::loadXML(): XML declaration allowed only at the start of the document in Entity, line: 6

exception: [Warning] Line 47 of core/lib/Drupal/Core/EventSubscriber/RssResponseRelativeUrlFilter.php:
DOMDocument::loadXML(): XML declaration allowed only at the start of the document in Entity, line: 6
nkno
fail: [Fatal error] Line 0 of :
[07-Oct-2016 18:52:05 Australia/Sydney] Uncaught PHP Exception Exception: "Warning: DOMDocument::loadXML(): XML declaration allowed only at the start of the document in Entity, line: 6


fail: [Fatal error] Line 0 of :
Drupal\Core\EventSubscriber\RssResponseRelativeUrlFilter->transformRootRelativeUrlsToAbsolute()() (Line: 47)


fail: [Fatal error] Line 0 of :
" at /var/www/html/core/lib/Drupal/Core/Test/HttpClientMiddleware/TestHttpClientMiddleware.php line 44


fail: [Fatal error] Line 0 of :
[07-Oct-2016 18:52:07 Australia/Sydney] Uncaught PHP Exception Exception: "Warning: DOMDocument::loadXML(): XML declaration allowed only at the start of the document in Entity, line: 6


fail: [Fatal error] Line 0 of :
Drupal\Core\EventSubscriber\RssResponseRelativeUrlFilter->transformRootRelativeUrlsToAbsolute()() (Line: 47)


fail: [Fatal error] Line 0 of :
" at /var/www/html/core/lib/Drupal/Core/Test/HttpClientMiddleware/TestHttpClientMiddleware.php line 44
- setUp
- createFeed
- updateFeedItems
- deleteFeed
53Aggregator.Drupal\aggregator\Tests\FeedFetcherPluginTest
transformRootRelativeUrlsToAbsolute
exception: [Warning] Line 47 of core/lib/Drupal/Core/EventSubscriber/RssResponseRelativeUrlFilter.php:
DOMDocument::loadXML(): XML declaration allowed only at the start of the document in Entity, line: 6

exception: [Warning] Line 47 of core/lib/Drupal/Core/EventSubscriber/RssResponseRelativeUrlFilter.php:
DOMDocument::loadXML(): XML declaration allowed only at the start of the document in Entity, line: 6
testfetch
fail: [Other] Line 32 of core/modules/aggregator/src/Tests/FeedFetcherPluginTest.php:
Value true is FALSE.
nkno
fail: [Fatal error] Line 0 of :
[07-Oct-2016 18:52:10 Australia/Sydney] Uncaught PHP Exception Exception: "Warning: DOMDocument::loadXML(): XML declaration allowed only at the start of the document in Entity, line: 6


fail: [Fatal error] Line 0 of :
Drupal\Core\EventSubscriber\RssResponseRelativeUrlFilter->transformRootRelativeUrlsToAbsolute()() (Line: 47)


fail: [Fatal error] Line 0 of :
" at /var/www/html/core/lib/Drupal/Core/Test/HttpClientMiddleware/TestHttpClientMiddleware.php line 44
- setUp
- createSampleNodes
- createFeed
- updateFeedItems
- deleteFeedItems
31Aggregator.Drupal\aggregator\Tests\FeedLanguageTest
testFeedLanguage
fail: [Other] Line 78 of core/modules/aggregator/src/Tests/FeedLanguageTest.php:
Feed items were created.

fail: [Other] Line 78 of core/modules/aggregator/src/Tests/FeedLanguageTest.php:
Feed items were created.
- setUp
- createFeed
- createSampleNodes
64Aggregator.Drupal\aggregator\Tests\FeedProcessorPluginTest
transformRootRelativeUrlsToAbsolute
exception: [Warning] Line 47 of core/lib/Drupal/Core/EventSubscriber/RssResponseRelativeUrlFilter.php:
DOMDocument::loadXML(): XML declaration allowed only at the start of the document in Entity, line: 6

exception: [Warning] Line 47 of core/lib/Drupal/Core/EventSubscriber/RssResponseRelativeUrlFilter.php:
DOMDocument::loadXML(): XML declaration allowed only at the start of the document in Entity, line: 6

exception: [Warning] Line 47 of core/lib/Drupal/Core/EventSubscriber/RssResponseRelativeUrlFilter.php:
DOMDocument::loadXML(): XML declaration allowed only at the start of the document in Entity, line: 6
nkno
fail: [Fatal error] Line 0 of :
[07-Oct-2016 18:52:09 Australia/Sydney] Uncaught PHP Exception Exception: "Warning: DOMDocument::loadXML(): XML declaration allowed only at the start of the document in Entity, line: 6


fail: [Fatal error] Line 0 of :
Drupal\Core\EventSubscriber\RssResponseRelativeUrlFilter->transformRootRelativeUrlsToAbsolute()() (Line: 47)


fail: [Fatal error] Line 0 of :
" at /var/www/html/core/lib/Drupal/Core/Test/HttpClientMiddleware/TestHttpClientMiddleware.php line 44


fail: [Fatal error] Line 0 of :
[07-Oct-2016 18:52:37 Australia/Sydney] Uncaught PHP Exception Exception: "Warning: DOMDocument::loadXML(): XML declaration allowed only at the start of the document in Entity, line: 6


fail: [Fatal error] Line 0 of :
Drupal\Core\EventSubscriber\RssResponseRelativeUrlFilter->transformRootRelativeUrlsToAbsolute()() (Line: 47)


fail: [Fatal error] Line 0 of :
" at /var/www/html/core/lib/Drupal/Core/Test/HttpClientMiddleware/TestHttpClientMiddleware.php line 44


fail: [Fatal error] Line 0 of :
[07-Oct-2016 18:53:06 Australia/Sydney] Uncaught PHP Exception Exception: "Warning: DOMDocument::loadXML(): XML declaration allowed only at the start of the document in Entity, line: 6


fail: [Fatal error] Line 0 of :
Drupal\Core\EventSubscriber\RssResponseRelativeUrlFilter->transformRootRelativeUrlsToAbsolute()() (Line: 47)


fail: [Fatal error] Line 0 of :
" at /var/www/html/core/lib/Drupal/Core/Test/HttpClientMiddleware/TestHttpClientMiddleware.php line 44
updateAndDelete
fail: [Other] Line 213 of core/modules/aggregator/src/Tests/AggregatorTestBase.php:
Value '0' is TRUE.
testPostProcess
fail: [Other] Line 64 of core/modules/aggregator/src/Tests/FeedProcessorPluginTest.php:
Value '1800' is equal to value 3600.
- setUp
- createSampleNodes
- createFeed
- updateFeedItems
- deleteFeedItems
- testDelete
63Aggregator.Drupal\aggregator\Tests\UpdateFeedItemTest
transformRootRelativeUrlsToAbsolute
exception: [Warning] Line 47 of core/lib/Drupal/Core/EventSubscriber/RssResponseRelativeUrlFilter.php:
DOMDocument::loadXML(): XML declaration allowed only at the start of the document in Entity, line: 6
updateFeedItems
fail: [Other] Line 187 of core/modules/aggregator/src/Tests/AggregatorTestBase.php:
Total items in feed equal to the total items in database (5 != 0)
Value '5' is equal to value 0.
nkno
fail: [Fatal error] Line 0 of :
[07-Oct-2016 18:52:10 Australia/Sydney] Uncaught PHP Exception Exception: "Warning: DOMDocument::loadXML(): XML declaration allowed only at the start of the document in Entity, line: 6


fail: [Fatal error] Line 0 of :
Drupal\Core\EventSubscriber\RssResponseRelativeUrlFilter->transformRootRelativeUrlsToAbsolute()() (Line: 47)


fail: [Fatal error] Line 0 of :
" at /var/www/html/core/lib/Drupal/Core/Test/HttpClientMiddleware/TestHttpClientMiddleware.php line 44
- setUp
- createSampleNodes
- createFeed
- deleteFeedItems
- deleteFeed
- testUpdateFeedItem
4Aggregator.Drupal\aggregator\Tests\AggregatorAdminTest
- setUp
- testSettingsPage
- createFeed
- testOverviewPage
6Aggregator.Drupal\aggregator\Tests\DeleteFeedItemTest
- setUp
- createFeed
- updateFeedItems
- updateAndDelete
- deleteFeedItems
- deleteFeed
4Aggregator.Drupal\aggregator\Tests\DeleteFeedTest
- setUp
- createFeed
- deleteFeed
- testDeleteFeed
5Aggregator.Drupal\aggregator\Tests\FeedCacheTagsTest
- setUp
- testEntityUri
- verifyPageCache
- testReferencedEntity
- verifyRenderCache
7Aggregator.Drupal\aggregator\Tests\FeedParserTest
- setUp
- createFeed
- testRSS091Sample
- testAtomSample
- testHtmlEntitiesSample
- testRedirectFeed
- testInvalidFeed
4Aggregator.Drupal\aggregator\Tests\ImportOpmlTest
- setUp
- openImportForm
- validateImportFormFields
- submitImportForm
5Aggregator.Drupal\aggregator\Tests\ItemCacheTagsTest
- setUp
- verifyRenderCache
- testEntityCreation
- testReferencedEntity
- verifyPageCache
4Aggregator.Drupal\aggregator\Tests\UpdateFeedTest
- setUp
- createFeed
- testUpdateFeed
- deleteFeed
1Aggregator.Drupal\Tests\aggregator\Kernel\FeedValidationTest
- testValidation
1Aggregator.Drupal\Tests\aggregator\Kernel\ItemWithoutFeedTest
- testEntityCreation
1Aggregator.Drupal\Tests\aggregator\Kernel\Migrate\d7\MigrateAggregatorSettingsTest
- testMigration
2Aggregator.Drupal\Tests\aggregator\Kernel\Migrate\MigrateAggregatorStubTest
- testFeedStub
- testItemStub
1Aggregator.Drupal\Tests\aggregator\Kernel\Views\AggregatorFeedViewsFieldAccessTest
- testAggregatorFeedFields
1Aggregator.Drupal\Tests\aggregator\Kernel\Views\AggregatorItemViewsFieldAccessTest
- testAggregatorItemFields
1Aggregator.Drupal\Tests\aggregator\Kernel\Views\IntegrationTest
- testAggregatorItemView
4Aggregator.Drupal\Tests\aggregator\Unit\Menu\AggregatorLocalTasksTest
- testAggregatorAdminLocalTasks with data set #0
- testAggregatorAdminLocalTasks with data set #1
- testAggregatorSourceLocalTasks with data set #0
- testAggregatorSourceLocalTasks with data set #1
1Aggregator.Drupal\Tests\aggregator\Unit\Plugin\AggregatorPluginSettingsBaseTest
- testSettingsForm
3Aggregator.Drupal\Tests\aggregator\Unit\Plugin\migrate\source\AggregatorItemTest
- testRetrieval
- testSourceCount
- testSourceId
3Aggregator.Drupal\Tests\aggregator\Unit\Plugin\migrate\source\d6\AggregatorFeedTest
- testRetrieval
- testSourceCount
- testSourceId
3Aggregator.Drupal\Tests\aggregator\Unit\Plugin\migrate\source\d7\AggregatorFeedTest
- testRetrieval
- testSourceCount
- testSourceId
1092Asset.Asset
2Asset.Drupal\KernelTests\Core\Asset\ResolvedLibraryDefinitionsFilesMatchTest
testCoreLibraryCompleteness
fail: [Other] Line 125 of core/tests/Drupal/KernelTests/Core/Asset/ResolvedLibraryDefinitionsFilesMatchTest.php:
Failed asserting that false is true.
rupal\KernelTests\Core\Asset\ResolvedLibraryDefinitionsFilesMatchTe
fail: [Other] Line 0 of sites/default/files/simpletest/phpunit-68.xml:
PHPunit Test failed to complete; Error: PHPUnit 4.8.27 by Sebastian Bergmann and contributors.

F

Time: 1.01 minutes, Memory: 2.75Mb

There was 1 failure:

1) Drupal\KernelTests\Core\Asset\ResolvedLibraryDefinitionsFilesMatchTest::testCoreLibraryCompleteness
core/themes/seven/css/components/system-status-report-counters.css file referenced from the seven/global-styling library exists.
Failed asserting that false is true.

/var/www/html/core/tests/Drupal/KernelTests/AssertLegacyTrait.php:31
/var/www/html/core/tests/Drupal/KernelTests/Core/Asset/ResolvedLibraryDefinitionsFilesMatchTest.php:162
/var/www/html/core/tests/Drupal/KernelTests/Core/Asset/ResolvedLibraryDefinitionsFilesMatchTest.php:127

FAILURES!
Tests: 1, Assertions: 305, Failures: 1.
4Asset.Drupal\Tests\Core\Asset\AssetResolverTest
- testGetCssAssets with data set "same libraries, different timestamps"
- testGetCssAssets with data set "different libraries, same timestamps"
- testGetJsAssets with data set "same libraries, different timestamps"
- testGetJsAssets with data set "different libraries, same timestamps"
1Asset.Drupal\Tests\Core\Asset\CssCollectionGrouperUnitTest
- testGrouper
7Asset.Drupal\Tests\Core\Asset\CssCollectionRendererUnitTest
- testRender with data set #0
- testRender with data set #2
- testRender with data set #3
- testRender with data set #4
- testRender with data set #5
- testRender with data set #6
- testRenderInvalidType
12Asset.Drupal\Tests\Core\Asset\CssOptimizerUnitTest
- testOptimize with data set #0
- testOptimize with data set #1
- testOptimize with data set #2
- testOptimize with data set #3
- testOptimize with data set #4
- testOptimize with data set #5
- testOptimize with data set #6
- testOptimize with data set #7
- testOptimize with data set #8
- testOptimize with data set #9
- testTypeFilePreprocessingDisabled
- testTypeExternal
7Asset.Drupal\Tests\Core\Asset\JsOptimizerUnitTest
- testClean with data set #0
- testClean with data set #1
- testClean with data set #2
- testClean with data set #3
- testOptimize with data set #0
- testOptimize with data set #1
- testOptimize with data set #2
60Asset.Drupal\Tests\Core\Asset\LibraryDependencyResolverTest
- testGetLibrariesWithDependencies with data set #0
- testGetLibrariesWithDependencies with data set #1
- testGetLibrariesWithDependencies with data set #2
- testGetLibrariesWithDependencies with data set #3
- testGetLibrariesWithDependencies with data set #4
- testGetLibrariesWithDependencies with data set #5
- testGetLibrariesWithDependencies with data set #6
- testGetLibrariesWithDependencies with data set #7
- testGetLibrariesWithDependencies with data set #8
- testGetLibrariesWithDependencies with data set #9
- testGetLibrariesWithDependencies with data set #10
- testGetLibrariesWithDependencies with data set #11
- testGetLibrariesWithDependencies with data set #12
- testGetLibrariesWithDependencies with data set #13
- testGetLibrariesWithDependencies with data set #14
- testGetLibrariesWithDependencies with data set #15
- testGetLibrariesWithDependencies with data set #16
- testGetLibrariesWithDependencies with data set #17
- testGetLibrariesWithDependencies with data set #18
- testGetLibrariesWithDependencies with data set #19
- testGetLibrariesWithDependencies with data set #20
- testGetLibrariesWithDependencies with data set #21
- testGetLibrariesWithDependencies with data set #22
- testGetLibrariesWithDependencies with data set #23
- testGetLibrariesWithDependencies with data set #24
- testGetLibrariesWithDependencies with data set #25
- testGetLibrariesWithDependencies with data set #26
- testGetLibrariesWithDependencies with data set #27
- testGetLibrariesWithDependencies with data set #28
- testGetLibrariesWithDependencies with data set #29
- testGetMinimalRepresentativeSubset with data set #0
- testGetMinimalRepresentativeSubset with data set #1
- testGetMinimalRepresentativeSubset with data set #2
- testGetMinimalRepresentativeSubset with data set #3
- testGetMinimalRepresentativeSubset with data set #4
- testGetMinimalRepresentativeSubset with data set #5
- testGetMinimalRepresentativeSubset with data set #6
- testGetMinimalRepresentativeSubset with data set #7
- testGetMinimalRepresentativeSubset with data set #8
- testGetMinimalRepresentativeSubset with data set #9
- testGetMinimalRepresentativeSubset with data set #10
- testGetMinimalRepresentativeSubset with data set #11
- testGetMinimalRepresentativeSubset with data set #12
- testGetMinimalRepresentativeSubset with data set #13
- testGetMinimalRepresentativeSubset with data set #14
- testGetMinimalRepresentativeSubset with data set #15
- testGetMinimalRepresentativeSubset with data set #16
- testGetMinimalRepresentativeSubset with data set #17
- testGetMinimalRepresentativeSubset with data set #18
- testGetMinimalRepresentativeSubset with data set #19
- testGetMinimalRepresentativeSubset with data set #20
- testGetMinimalRepresentativeSubset with data set #21
- testGetMinimalRepresentativeSubset with data set #22
- testGetMinimalRepresentativeSubset with data set #23
- testGetMinimalRepresentativeSubset with data set #24
- testGetMinimalRepresentativeSubset with data set #25
- testGetMinimalRepresentativeSubset with data set #26
- testGetMinimalRepresentativeSubset with data set #27
- testGetMinimalRepresentativeSubset with data set #28
- testGetMinimalRepresentativeSubset with data set #29
2Asset.Drupal\Tests\Core\Asset\LibraryDiscoveryCollectorTest
- testResolveCacheMiss
- testDestruct
15Asset.Drupal\Tests\Core\Asset\LibraryDiscoveryParserTest
- testBuildByExtensionSimple
- testBuildByExtensionWithTheme
- testBuildByExtensionWithMissingLibraryFile
- testInvalidLibrariesFile
- testBuildByExtensionWithMissingInformation
- testVersion
- testExternalLibraries
- testDefaultCssWeights
- testJsWithPositiveWeight
- testLibraryWithCssJsSetting
- testLibraryWithDependencies
- testLibraryWithDataTypes
- testLibraryWithJavaScript
- testLibraryThirdPartyWithMissingLicense
- testLibraryWithLicenses
1Asset.Drupal\Tests\Core\Asset\LibraryDiscoveryTest
- testGetLibrariesByExtension
247Batch.Batch
27Batch.Drupal\system\Tests\Batch\ProcessingTest
testBatchNoForm
fail: [Other] Line 28 of core/modules/system/src/Tests/Batch/ProcessingTest.php:
Batch for step 2 performed successfully.
testBatchRedirectFinishedCallback
fail: [Other] Line 39 of core/modules/system/src/Tests/Batch/ProcessingTest.php:
Batch for step 2 performed successfully.
testBatchForm
fail: [Other] Line 53 of core/modules/system/src/Tests/Batch/ProcessingTest.php:
Batch with no operation performed successfully.

fail: [Other] Line 60 of core/modules/system/src/Tests/Batch/ProcessingTest.php:
Batch with simple operations performed successfully.

fail: [Other] Line 68 of core/modules/system/src/Tests/Batch/ProcessingTest.php:
Batch with multistep operation performed successfully.

fail: [Other] Line 76 of core/modules/system/src/Tests/Batch/ProcessingTest.php:
Batch with simple and multistep operations performed successfully.

fail: [Other] Line 84 of core/modules/system/src/Tests/Batch/ProcessingTest.php:
Nested batch performed successfully.
testBatchFormMultistep
fail: [Other] Line 99 of core/modules/system/src/Tests/Batch/ProcessingTest.php:
Batch for step 1 performed successfully.

fail: [Other] Line 106 of core/modules/system/src/Tests/Batch/ProcessingTest.php:
Batch for step 2 performed successfully.
testBatchFormMultipleBatches
fail: [Other] Line 122 of core/modules/system/src/Tests/Batch/ProcessingTest.php:
Batches defined in separate submit handlers performed successfully.
testBatchFormProgrammatic
fail: [Other] Line 140 of core/modules/system/src/Tests/Batch/ProcessingTest.php:
Batches defined in separate submit handlers performed successfully.
testBatchLargePercentage
fail: [Other] Line 166 of core/modules/system/src/Tests/Batch/ProcessingTest.php:
Batch for step 2 performed successfully.
- impletest_script_run_one_test
- testDrupalFormSubmitInBatch
4Batch.Drupal\system\Tests\Batch\PageTest
- impletest_script_run_one_test
- testBatchProgressPageTheme
- testBatchProgressPageTitle
- testBatchProgressMessages
18Batch.Drupal\Tests\Core\Batch\PercentagesTest
- testPercentages with data set #0
- testPercentages with data set #1
- testPercentages with data set #2
- testPercentages with data set #3
- testPercentages with data set #4
- testPercentages with data set #5
- testPercentages with data set #6
- testPercentages with data set #7
- testPercentages with data set #8
- testPercentages with data set #9
- testPercentages with data set #10
- testPercentages with data set #11
- testPercentages with data set #12
- testPercentages with data set #13
- testPercentages with data set #14
- testPercentages with data set #15
- testPercentages with data set #16
- testPercentages with data set #17
265Big_pipe.Big_pipe
42Big_pipe.Drupal\big_pipe\Tests\BigPipeTest
testBigPipe
fail: [Other] Line 178 of core/modules/big_pipe/src/Tests/BigPipeTest.php:
Value '[{"command":"settings","settings":{"ajaxPageState":{"theme":"classy","libraries":"big_pipe\\/big_pipe,classy\\/base,classy\\/messages,core\\/drupal.active-link,core\\/html5shiv,core\\/normalize,system\\/base"},"pluralDelimiter":"\\u0003","user":{"uid":"1","permissionsHash":"f9d06d42d562f90d3584c17e055fc3eebd93876c29bf824ce13b64a28ad3513a"}},"merge":true},{"command":"add_css","data":"\\u003Clink rel=\\u0022stylesheet\\u0022 href=\\u0022\\/checkout\\/core\\/themes\\/classy\\/css\\/components\\/messages.css?oeo36t\\u0022 media=\\u0022all\\u0022 \\/\\u003E\\n"},{"command":"insert","method":"replaceWith","selector":"[data-big-pipe-placeholder-id=\\u0022callback=Drupal%5CCore%5CRender%5CElement%5CStatusMessages%3A%3ArenderMessages\\u0026args[0]\\u0026token=a8c34b5e\\u0022]","data":"\\n    \\u003Cdiv role=\\u0022contentinfo\\u0022 aria-label=\\u0022Status message\\u0022 class=\\u0022messages messages--status\\u0022\\u003E\\n                  \\u003Ch2 class=\\u0022visually-hidden\\u0022\\u003EStatus message\\u003C\\/h2\\u003E\\n                    Hello from BigPipe!\\n            \\u003C\\/div\\u003E\\n    ","settings":null}]' is equal to value '[{"command":"settings","settings":{"ajaxPageState":{"theme":"classy","libraries":"big_pipe\\/big_pipe,classy\\/base,classy\\/messages,core\\/drupal.active-link,core\\/html5shiv,core\\/normalize,system\\/base"},"pluralDelimiter":"\\u0003","user":{"uid":"1","permissionsHash":"f9d06d42d562f90d3584c17e055fc3eebd93876c29bf824ce13b64a28ad3513a"}},"merge":true},{"command":"add_css","data":"\\u003Clink rel=\\u0022stylesheet\\u0022 href=\\u0022\\/checkout\\/core\\/themes\\/classy\\/css\\/components\\/messages.css?oeo36t\\u0022 media=\\u0022all\\u0022 \\/\\u003E\\n"},{"command":"insert","method":"replaceWith","selector":"[data-big-pipe-placeholder-id=\\u0022callback=Drupal%5CCore%5CRender%5CElement%5CStatusMessages%3A%3ArenderMessages\\u0026args[0]\\u0026token=a8c34b5e\\u0022]","data":"\\n\\n\\u003C!-- THEME DEBUG --\\u003E\\n\\u003C!-- THEME HOOK: \\u0027status_messages\\u0027 --\\u003E\\n\\u003C!-- BEGIN OUTPUT from \\u0027core\\/themes\\/classy\\/templates\\/misc\\/status-messages.html.twig\\u0027 --\\u003E\\n\\n    \\u003Cdiv role=\\u0022contentinfo\\u0022 aria-label=\\u0022Status message\\u0022 class=\\u0022messages messages--status\\u0022\\u003E\\n                  \\u003Ch2 class=\\u0022visually-hidden\\u0022\\u003EStatus message\\u003C\\/h2\\u003E\\n                    Hello from BigPipe!\\n            \\u003C\\/div\\u003E\\n    \\n\\u003C!-- END OUTPUT from \\u0027core\\/themes\\/classy\\/templates\\/misc\\/status-messages.html.twig\\u0027 --\\u003E\\n\\n","settings":null}]'.
testBigPipeNoJs
fail: [Other] Line 249 of core/modules/big_pipe/src/Tests/BigPipeTest.php:
Raw "

    
                  Status message
                    Hello from BigPipe!
            
    
" found
- setUp
- testNoJsDetection
- performMetaRefresh
- testBigPipeMultiOccurrencePlaceholders
23Big_pipe.Drupal\Tests\big_pipe\FunctionalJavascript\BigPipeRegressionTest
testMultipleClosingBodies_2678662
fail: [Other] Line 122 of core/modules/big_pipe/tests/src/FunctionalJavascript/BigPipeRegressionTest.php:
Drupal\Tests\big_pipe\FunctionalJavascript\BigPipeRegressionTest::testMultipleClosingBodies_2678662
Behat\Mink\Exception\ExpectationException: The string "


" was not found anywhere in the HTML response of the current page.

/var/www/html/vendor/behat/mink/src/WebAssert.php:770
/var/www/html/vendor/behat/mink/src/WebAssert.php:325
/var/www/html/core/modules/big_pipe/tests/src/FunctionalJavascript/BigPipeRegressionTest.php:140
rupal\Tests\big_pipe\FunctionalJavascript\BigPipeRegressionTe
fail: [Other] Line 0 of sites/default/files/simpletest/phpunit-2252.xml:
PHPunit Test failed to complete; Error: PHPUnit 4.8.27 by Sebastian Bergmann and contributors.

.E.

Time: 28.95 seconds, Memory: 3.00Mb

There was 1 error:

1) Drupal\Tests\big_pipe\FunctionalJavascript\BigPipeRegressionTest::testMultipleClosingBodies_2678662
Behat\Mink\Exception\ExpectationException: The string "


" was not found anywhere in the HTML response of the current page.

/var/www/html/vendor/behat/mink/src/WebAssert.php:770
/var/www/html/vendor/behat/mink/src/WebAssert.php:325
/var/www/html/core/modules/big_pipe/tests/src/FunctionalJavascript/BigPipeRegressionTest.php:140

FAILURES!
Tests: 3, Assertions: 17, Errors: 1.
nkno
fail: [run-tests.sh check] Line 0 of :
FATAL Drupal\Tests\big_pipe\FunctionalJavascript\BigPipeRegressionTest: test runner returned a non-zero error code (2).
- testCommentForm_2698811
- testMessages_2712935
12Big_pipe.Drupal\Tests\big_pipe\Unit\Render\BigPipeResponseAttachmentsProcessorTest
- testNonHtmlResponse with data set "AjaxResponse, which implements AttachmentsInterface"
- testNonHtmlResponse with data set "A dummy that implements AttachmentsInterface"
- testHtmlResponse with data set "no attachments"
- testHtmlResponse with data set "libraries"
- testHtmlResponse with data set "libraries + drupalSettings"
- testHtmlResponse with data set "all official attachment types, with random assigned values, even if technically not valid, to pr
- testHtmlResponse with data set "random attachment type (unofficial), with random assigned value, to prove BigPipeResponseAttachm
- testHtmlResponse with data set "only big_pipe_placeholders"
- testHtmlResponse with data set "only big_pipe_nojs_placeholders"
- testHtmlResponse with data set "big_pipe_placeholders + big_pipe_nojs_placeholders"
- testHtmlResponse with data set "all official attachment types + big_pipe_placeholders + big_pipe_nojs_placeholders"
- testHtmlResponse with data set "random attachment types + big_pipe_placeholders + big_pipe_nojs_placeholders"
8Big_pipe.Drupal\Tests\big_pipe\Unit\Render\Placeholder\BigPipeStrategyTest
- testProcessPlaceholders with data set "_no_big_pipe absent, no session, no-JS cookie absent"
- testProcessPlaceholders with data set "_no_big_pipe absent, no session, no-JS cookie present"
- testProcessPlaceholders with data set "_no_big_pipe present, no session, no-JS cookie absent"
- testProcessPlaceholders with data set "_no_big_pipe present, no session, no-JS cookie present"
- testProcessPlaceholders with data set "_no_big_pipe present, session, no-JS cookie absent"
- testProcessPlaceholders with data set "_no_big_pipe present, session, no-JS cookie present"
- testProcessPlaceholders with data set "_no_big_pipe absent, session, no-JS cookie absent: (JS-powered) BigPipe placeholder used
- testProcessPlaceholders with data set "_no_big_pipe absent, session, no-JS cookie present: no-JS BigPipe placeholder used for HT
1261Block.Block
61Block.Drupal\block\Tests\Views\DisplayBlockTest
testBlockContextualLinks
fail: [Other] Line 369 of core/modules/block/src/Tests/Views/DisplayBlockTest.php:
Value '





Configure blockEdit view


' is identical to value 'Configure blockEdit view'.

fail: [Other] Line 370 of core/modules/block/src/Tests/Views/DisplayBlockTest.php:
Value '





Configure blockEdit view


' is identical to value 'Configure blockEdit view'.
- setUp
- testBlockCategory
- testDeleteBlockDisplay
- testViewsBlockForm
- testBlockRendering
- testBlockEmptyRendering
2Block.Drupal\Tests\system\Kernel\Block\SystemMenuBlockTest
- testSystemMenuBlockConfigDependencies
- testConfigLevelDepth
3Block.Drupal\block\Tests\BlockAdminThemeTest
- impletest_script_run_one_test
- testAdminTheme
- testSevenAdminTheme
6Block.Drupal\block\Tests\BlockCacheTest
- setUp
- testCachePerRole
- testCachePermissions
- testNoCache
- testCachePerUser
- testCachePerPage
3Block.Drupal\block\Tests\BlockFormInBlockTest
- setUp
- testCachePerPage
- testPlaceholders
2Block.Drupal\block\Tests\BlockHiddenRegionTest
- setUp
- testBlockNotInHiddenRegion
2Block.Drupal\block\Tests\BlockHookOperationTest
- setUp
- testBlockOperationAlter
2Block.Drupal\block\Tests\BlockHtmlTest
- setUp
- testHtml
1Block.Drupal\block\Tests\BlockInstallTest
- testCacheTagInvalidationUponInstallation
2Block.Drupal\block\Tests\BlockInvalidRegionTest
- setUp
- testBlockInInvalidRegion
2Block.Drupal\block\Tests\BlockLanguageCacheTest
- setUp
- testBlockLinks
4Block.Drupal\block\Tests\BlockLanguageTest
- setUp
- testLanguageBlockVisibility
- testLanguageBlockVisibilityLanguageDelete
- testMultipleLanguageTypes
2Block.Drupal\block\Tests\BlockRenderOrderTest
- setUp
- testBlockRenderOrder
2Block.Drupal\block\Tests\BlockSystemBrandingTest
- setUp
- testSystemBrandingSettings
2Block.Drupal\block\Tests\BlockTemplateSuggestionsTest
- impletest_script_run_one_test
- testBlockThemeHookSuggestions
16Block.Drupal\block\Tests\BlockTest
- setUp
- testBlockVisibility
- testBlockToggleVisibility
- testBlockVisibilityListedEmpty
- testAddBlockFromLibrary
- testAddBlockFromLibraryWithWeight
- testBlock
- moveBlockToRegion
- testBlockThemeSelector
- testThemeName
- testHideBlockTitle
- testBlockCacheTags
- testThemeAdminLink
- testUninstallTheme
- testBlockAccess
- testBlockUserRoleDelete
9Block.Drupal\block\Tests\BlockUiTest
- setUp
- testBlockDemoUiPage
- testBlockAdminUiPage
- testCandidateBlockList
- testContextAwareUnsatisfiedBlocks
- testContextAwareBlocks
- testMachineNameSuggestion
- testBlockPlacementIndicator
- testBlockValidateErrors
8Block.Drupal\block\Tests\BlockXssTest
- impletest_script_run_one_test
- testNoUnexpectedEscaping
- testXssInTitle
- testXssInCategory
- testBlockXss
- doViewTest
- doMenuTest
- doBlockContentTest
2Block.Drupal\block\Tests\NewDefaultThemeBlocksTest
- impletest_script_run_one_test
- testNewDefaultThemeBlocks
2Block.Drupal\block\Tests\NonDefaultBlockAdminTest
- setUp
- testNonDefaultBlockAdmin
1Block.Drupal\KernelTests\Core\Block\MultipleBlockFormTest
- testMultipleForms
1Block.Drupal\Tests\block\Kernel\BlockConfigSchemaTest
- testBlockConfigSchema
1Block.Drupal\Tests\block\Kernel\BlockInterfaceTest
- testBlockInterface
3Block.Drupal\Tests\block\Kernel\BlockRebuildTest
- testRebuildNoBlocks
- testRebuildNoInvalidBlocks
- testRebuildInvalidBlocks
2Block.Drupal\Tests\block\Kernel\BlockStorageUnitTest
- testBlockCRUD
- testDefaultBlocks
4Block.Drupal\Tests\block\Kernel\BlockViewBuilderTest
- testBasicRendering
- testBlockViewBuilderCache
- testBlockViewBuilderViewAlter
- testBlockViewBuilderBuildAlter
1Block.Drupal\Tests\block\Kernel\Migrate\d7\MigrateBlockTest
- testBlockMigration
1Block.Drupal\Tests\block\Unit\BlockConfigEntityUnitTest
- testCalculateDependencies
1Block.Drupal\Tests\block\Unit\BlockFormTest
- testGetUniqueMachineName
2Block.Drupal\Tests\block\Unit\BlockRepositoryTest
- testGetVisibleBlocksPerRegion with data set #0
- testGetVisibleBlocksPerRegionWithContext
4Block.Drupal\Tests\block\Unit\CategoryAutocompleteTest
- testAutocompleteSuggestions with data set #0
- testAutocompleteSuggestions with data set #1
- testAutocompleteSuggestions with data set #2
- testAutocompleteSuggestions with data set #3
3Block.Drupal\Tests\block\Unit\Menu\BlockLocalTasksTest
- testBlockAdminLocalTasks
- testBlockAdminDisplay with data set #0
- testBlockAdminDisplay with data set #1
4Block.Drupal\Tests\block\Unit\Plugin\DisplayVariant\BlockPageVariantTest
- testBuild with data set #0
- testBuild with data set #1
- testBuild with data set #2
- testBuildWithoutMainContent
2Block.Drupal\Tests\block\Unit\Plugin\migrate\process\BlockRegionTest
- testTransformSameThemeRegionExists
- testTransformSameThemeRegionNotExists
5Block.Drupal\Tests\block\Unit\Plugin\migrate\process\BlockVisibilityTest
- testTransformNoData
- testTransformSinglePageWithFront
- testTransformMultiplePagesWithFront
- testTransformPhpEnabled
- testTransformPhpDisabled
3Block.Drupal\Tests\block\Unit\Plugin\migrate\source\BlockTest
- testRetrieval
- testSourceCount
- testSourceId
1Block.Drupal\Tests\Core\Block\BlockBaseTest
- testGetMachineNameSuggestion
7Block.Drupal\Tests\responsive_image\Unit\ResponsiveImageStyleConfigEntityUnitTest
- testCalculateDependencies
- testHasImageStyleMappings
- testGetImageStyleMapping
- testGetKeyedImageStyleMappings
- testGetImageStyleMappings
- testRemoveImageStyleMappings
- testSetBreakpointGroup
2Block.Drupal\Tests\views\Unit\Plugin\views\display\BlockTest
- testBuildNoOverride
- testBuildOverride
7765Comment.Comment
22Comment.Drupal\comment\Tests\CommentRssTest
testCommentRss
fail: [Other] Line 70 of core/modules/comment/src/Tests/CommentRssTest.php:
Comments as part of RSS feed.
transformRootRelativeUrlsToAbsolute
exception: [Warning] Line 47 of core/lib/Drupal/Core/EventSubscriber/RssResponseRelativeUrlFilter.php:
DOMDocument::loadXML(): XML declaration allowed only at the start of the document in Entity, line: 6

exception: [Warning] Line 47 of core/lib/Drupal/Core/EventSubscriber/RssResponseRelativeUrlFilter.php:
DOMDocument::loadXML(): XML declaration allowed only at the start of the document in Entity, line: 6
- setUp
- postComment
13Comment.Drupal\comment\Tests\Views\RowRssTest
transformRootRelativeUrlsToAbsolute
exception: [Warning] Line 47 of core/lib/Drupal/Core/EventSubscriber/RssResponseRelativeUrlFilter.php:
DOMDocument::loadXML(): XML declaration allowed only at the start of the document in Entity, line: 6
testRssRow
exception: [Notice] Line 29 of core/modules/comment/src/Tests/Views/RowRssTest.php:
Trying to get property of non-objectDrupal\comment\Tests\Views\RowRssTest->testRssRow() (Line: 1060)
Drupal\simpletest\TestBase->run(Array) (Line: 752)
simpletest_script_run_one_test('240', 'Drupal\comment\Tests\Views\RowRssTest') (Line: 66)
parse
exception: [Warning] Line 133 of core/modules/simpletest/src/AssertContentTrait.php:
simplexml_import_dom(): Invalid Nodetype to importsimplexml_import_dom(Object) (Line: 133)
Drupal\simpletest\WebTestBase->parse() (Line: 226)
Drupal\simpletest\WebTestBase->xpath('//item') (Line: 26)
Drupal\comment\Tests\Views\RowRssTest->testRssRow() (Line: 1060)
Drupal\simpletest\TestBase->run(Array) (Line: 752)
simpletest_script_run_one_test('240', 'Drupal\comment\Tests\Views\RowRssTest') (Line: 66)
- setUp
4Comment.Drupal\comment\Tests\CommentActionsTest
- setUp
- testCommentPublishUnpublishActions
- postComment
- testCommentUnpublishByKeyword
9Comment.Drupal\comment\Tests\CommentAdminTest
- setUp
- testApprovalAdminInterface
- setCommentSettings
- postComment
- getUnapprovedComment
- performCommentOperation
- testApprovalNodeInterface
- testCommentAdmin
- testEditComment
5Comment.Drupal\comment\Tests\CommentAnonymousTest
- setUp
- testAnonymous
- setCommentSettings
- postComment
- performCommentOperation
4Comment.Drupal\comment\Tests\CommentBlockTest
- setUp
- testRecentCommentBlock
- postComment
- setCommentSettings
2Comment.Drupal\comment\Tests\CommentBookTest
- setUp
- testBookCommentPrint
6Comment.Drupal\comment\Tests\CommentCacheTagsTest
- setUp
- verifyPageCache
- testCommentEntity
- testEntityUri
- verifyRenderCache
- testReferencedEntity
2Comment.Drupal\comment\Tests\CommentCSSTest
- setUp
- testCommentClasses
7Comment.Drupal\comment\Tests\CommentFieldsTest
- setUp
- testCommentDefaultFields
- testCommentFieldDelete
- testCommentFieldLinksNonDefaultName
- postComment
- testCommentFieldCreate
- testCommentInstallAfterContentModule
9Comment.Drupal\comment\Tests\CommentInterfaceTest
- setUp
- setCommentSettings
- setCommentSubject
- testCommentInterface
- postComment
- deleteComment
- testAutoFilledSubject
- testAutoFilledHtmlSubject
- testViewMode
2Comment.Drupal\comment\Tests\CommentLanguageTest
- setUp
- testCommentLanguage
3Comment.Drupal\comment\Tests\CommentLinksAlterTest
- setUp
- testCommentLinksAlter
- postComment
3Comment.Drupal\comment\Tests\CommentLinksTest
- setUp
- setCommentSettings
- testCommentLinks
3Comment.Drupal\comment\Tests\CommentNewIndicatorTest
- setUp
- testCommentNewCommentsIndicator
- renderNewCommentsNodeLinks
5Comment.Drupal\comment\Tests\CommentNodeAccessTest
- setUp
- testThreadedCommentView
- setCommentSettings
- setCommentSubject
- postComment
3Comment.Drupal\comment\Tests\CommentNodeChangesTest
- setUp
- testNodeDeletion
- postComment
7Comment.Drupal\comment\Tests\CommentNonNodeTest
- setUp
- testCommentFunctionality
- postComment
- performCommentOperation
- fieldUIAddNewField
- fieldUIDeleteField
- testsNonIntegerIdEntities
10Comment.Drupal\comment\Tests\CommentPagerTest
- setUp
- testCommentPaging
- setCommentSettings
- setCommentSubject
- postComment
- testCommentPermalink
- testCommentOrderingThreading
- testCommentNewPageIndicator
- testTwoPagers
- clickLinkWithXPath
7Comment.Drupal\comment\Tests\CommentPreviewTest
- setUp
- testCommentPreview
- setCommentSettings
- setCommentSubject
- testCommentPreviewDuplicateSubmission
- testCommentEditPreviewSave
- postComment
5Comment.Drupal\comment\Tests\CommentStatisticsTest
- setUp
- testCommentNodeCommentStatistics
- setCommentSettings
- setCommentSubject
- postComment
5Comment.Drupal\comment\Tests\CommentThreadingTest
- setUp
- testCommentThreading
- setCommentSettings
- setCommentSubject
- postComment
6Comment.Drupal\comment\Tests\CommentTitleTest
- setUp
- setCommentSettings
- setCommentSubject
- testCommentEmptyTitles
- postComment
- testCommentPopulatedTitles
4Comment.Drupal\comment\Tests\CommentTokenReplaceTest
- setUp
- testCommentTokenReplacement
- setCommentSubject
- postComment
13Comment.Drupal\comment\Tests\CommentTranslationUITest
- setUp
- setupBundle
- setupUsers
- testTranslateLinkCommentAdminPage
- doTestBasicTranslation
- doTestTranslationOverview
- doTestOutdatedStatus
- doTestPublishedStatus
- doTestAuthoringInfo
- doTestTranslationEdit
- doTestTranslationChanged
- doTestChangedTimeAfterSaveWithoutChanges
- doTestTranslationDeletion
4Comment.Drupal\comment\Tests\CommentTypeTest
- setUp
- testCommentTypeCreation
- testCommentTypeEditing
- testCommentTypeDeletion
3Comment.Drupal\comment\Tests\CommentUninstallTest
- setUp
- testCommentUninstallWithField
- testCommentUninstallWithoutField
2Comment.Drupal\comment\Tests\Update\CommentUpdateTest
- testCommentUpdate8101
- runUpdates
2Comment.Drupal\comment\Tests\Views\ArgumentUserUIDTest
- setUp
- testCommentUserUIDTest
2Comment.Drupal\comment\Tests\Views\CommentFieldFilterTest
- setUp
- testFilters
2Comment.Drupal\comment\Tests\Views\CommentFieldNameTest
- setUp
- testCommentFieldName
2Comment.Drupal\comment\Tests\Views\CommentOperationsTest
- setUp
- testCommentOperations
2Comment.Drupal\comment\Tests\Views\CommentRestExportTest
- setUp
- testCommentRestExport
2Comment.Drupal\comment\Tests\Views\CommentRowTest
- setUp
- testCommentRow
2Comment.Drupal\comment\Tests\Views\DefaultViewRecentCommentsTest
- setUp
- testBlockDisplay
2Comment.Drupal\comment\Tests\Views\FilterUserUIDTest
- setUp
- testCommentUserUIDTest
2Comment.Drupal\comment\Tests\Views\NodeCommentsTest
- setUp
- testNewComments
2Comment.Drupal\comment\Tests\Views\WizardTest
- setUp
- testCommentWizard
1Comment.Drupal\Tests\comment\Functional\CommentStatusFieldAccessTest
- testCommentStatusFieldAccessStatus
1Comment.Drupal\Tests\comment\Kernel\CommentDefaultFormatterCacheTagsTest
- testCacheTags
1Comment.Drupal\Tests\comment\Kernel\CommentFieldAccessTest
- testAccessToAdministrativeFields
1Comment.Drupal\Tests\comment\Kernel\CommentIntegrationTest
- testViewMode
1Comment.Drupal\Tests\comment\Kernel\CommentItemTest
- testCommentItem
1Comment.Drupal\Tests\comment\Kernel\CommentStringIdEntitiesTest
- testCommentFieldNonStringId
1Comment.Drupal\Tests\comment\Kernel\CommentValidationTest
- testValidation
1Comment.Drupal\Tests\comment\Kernel\Migrate\d7\MigrateCommentEntityDisplayTest
- testMigration
1Comment.Drupal\Tests\comment\Kernel\Migrate\d7\MigrateCommentEntityFormDisplaySubjectTest
- testMigration
1Comment.Drupal\Tests\comment\Kernel\Migrate\d7\MigrateCommentEntityFormDisplayTest
- testMigration
1Comment.Drupal\Tests\comment\Kernel\Migrate\d7\MigrateCommentFieldInstanceTest
- testMigration
1Comment.Drupal\Tests\comment\Kernel\Migrate\d7\MigrateCommentFieldTest
- testMigration
1Comment.Drupal\Tests\comment\Kernel\Migrate\d7\MigrateCommentTest
- testCommentMigration
1Comment.Drupal\Tests\comment\Kernel\Migrate\d7\MigrateCommentTypeTest
- testMigration
1Comment.Drupal\Tests\comment\Kernel\Migrate\MigrateCommentStubTest
- testStub
2Comment.Drupal\Tests\comment\Kernel\Views\CommentLinksTest
- testLinkApprove
- testLinkReply
1Comment.Drupal\Tests\comment\Kernel\Views\CommentUserNameTest
- testUsername
1Comment.Drupal\Tests\comment\Kernel\Views\CommentViewsFieldAccessTest
- testCommentFields
580Comment.Drupal\Tests\comment\Unit\CommentLinkBuilderTest
- testCommentLinkBuilder with data set #0
- testCommentLinkBuilder with data set #1
- testCommentLinkBuilder with data set #2
- testCommentLinkBuilder with data set #3
- testCommentLinkBuilder with data set #4
- testCommentLinkBuilder with data set #5
- testCommentLinkBuilder with data set #6
- testCommentLinkBuilder with data set #7
- testCommentLinkBuilder with data set #8
- testCommentLinkBuilder with data set #9
- testCommentLinkBuilder with data set #10
- testCommentLinkBuilder with data set #11
- testCommentLinkBuilder with data set #12
- testCommentLinkBuilder with data set #13
- testCommentLinkBuilder with data set #14
- testCommentLinkBuilder with data set #15
- testCommentLinkBuilder with data set #16
- testCommentLinkBuilder with data set #17
- testCommentLinkBuilder with data set #18
- testCommentLinkBuilder with data set #19
- testCommentLinkBuilder with data set #20
- testCommentLinkBuilder with data set #21
- testCommentLinkBuilder with data set #22
- testCommentLinkBuilder with data set #23
- testCommentLinkBuilder with data set #24
- testCommentLinkBuilder with data set #25
- testCommentLinkBuilder with data set #26
- testCommentLinkBuilder with data set #27
- testCommentLinkBuilder with data set #28
- testCommentLinkBuilder with data set #29
- testCommentLinkBuilder with data set #30
- testCommentLinkBuilder with data set #31
- testCommentLinkBuilder with data set #32
- testCommentLinkBuilder with data set #33
- testCommentLinkBuilder with data set #34
- testCommentLinkBuilder with data set #35
- testCommentLinkBuilder with data set #36
- testCommentLinkBuilder with data set #37
- testCommentLinkBuilder with data set #38
- testCommentLinkBuilder with data set #39
- testCommentLinkBuilder with data set #40
- testCommentLinkBuilder with data set #41
- testCommentLinkBuilder with data set #42
- testCommentLinkBuilder with data set #43
- testCommentLinkBuilder with data set #44
- testCommentLinkBuilder with data set #45
- testCommentLinkBuilder with data set #46
- testCommentLinkBuilder with data set #47
- testCommentLinkBuilder with data set #48
- testCommentLinkBuilder with data set #49
- testCommentLinkBuilder with data set #50
- testCommentLinkBuilder with data set #51
- testCommentLinkBuilder with data set #52
- testCommentLinkBuilder with data set #53
- testCommentLinkBuilder with data set #54
- testCommentLinkBuilder with data set #55
- testCommentLinkBuilder with data set #56
- testCommentLinkBuilder with data set #57
- testCommentLinkBuilder with data set #58
- testCommentLinkBuilder with data set #59
- testCommentLinkBuilder with data set #60
- testCommentLinkBuilder with data set #61
- testCommentLinkBuilder with data set #62
- testCommentLinkBuilder with data set #63
- testCommentLinkBuilder with data set #64
- testCommentLinkBuilder with data set #65
- testCommentLinkBuilder with data set #66
- testCommentLinkBuilder with data set #67
- testCommentLinkBuilder with data set #68
- testCommentLinkBuilder with data set #69
- testCommentLinkBuilder with data set #70
- testCommentLinkBuilder with data set #71
- testCommentLinkBuilder with data set #72
- testCommentLinkBuilder with data set #73
- testCommentLinkBuilder with data set #74
- testCommentLinkBuilder with data set #75
- testCommentLinkBuilder with data set #76
- testCommentLinkBuilder with data set #77
- testCommentLinkBuilder with data set #78
- testCommentLinkBuilder with data set #79
- testCommentLinkBuilder with data set #80
- testCommentLinkBuilder with data set #81
- testCommentLinkBuilder with data set #82
- testCommentLinkBuilder with data set #83
- testCommentLinkBuilder with data set #84
- testCommentLinkBuilder with data set #85
- testCommentLinkBuilder with data set #86
- testCommentLinkBuilder with data set #87
- testCommentLinkBuilder with data set #88
- testCommentLinkBuilder with data set #89
- testCommentLinkBuilder with data set #90
- testCommentLinkBuilder with data set #91
- testCommentLinkBuilder with data set #92
- testCommentLinkBuilder with data set #93
- testCommentLinkBuilder with data set #94
- testCommentLinkBuilder with data set #95
- testCommentLinkBuilder with data set #96
- testCommentLinkBuilder with data set #97
- testCommentLinkBuilder with data set #98
- testCommentLinkBuilder with data set #99
- testCommentLinkBuilder with data set #100
- testCommentLinkBuilder with data set #101
- testCommentLinkBuilder with data set #102
- testCommentLinkBuilder with data set #103
- testCommentLinkBuilder with data set #104
- testCommentLinkBuilder with data set #105
- testCommentLinkBuilder with data set #106
- testCommentLinkBuilder with data set #107
- testCommentLinkBuilder with data set #108
- testCommentLinkBuilder with data set #109
- testCommentLinkBuilder with data set #110
- testCommentLinkBuilder with data set #111
- testCommentLinkBuilder with data set #112
- testCommentLinkBuilder with data set #113
- testCommentLinkBuilder with data set #114
- testCommentLinkBuilder with data set #115
- testCommentLinkBuilder with data set #116
- testCommentLinkBuilder with data set #117
- testCommentLinkBuilder with data set #118
- testCommentLinkBuilder with data set #119
- testCommentLinkBuilder with data set #120
- testCommentLinkBuilder with data set #121
- testCommentLinkBuilder with data set #122
- testCommentLinkBuilder with data set #123
- testCommentLinkBuilder with data set #124
- testCommentLinkBuilder with data set #125
- testCommentLinkBuilder with data set #126
- testCommentLinkBuilder with data set #127
- testCommentLinkBuilder with data set #128
- testCommentLinkBuilder with data set #129
- testCommentLinkBuilder with data set #130
- testCommentLinkBuilder with data set #131
- testCommentLinkBuilder with data set #132
- testCommentLinkBuilder with data set #133
- testCommentLinkBuilder with data set #134
- testCommentLinkBuilder with data set #135
- testCommentLinkBuilder with data set #136
- testCommentLinkBuilder with data set #137
- testCommentLinkBuilder with data set #138
- testCommentLinkBuilder with data set #139
- testCommentLinkBuilder with data set #140
- testCommentLinkBuilder with data set #141
- testCommentLinkBuilder with data set #142
- testCommentLinkBuilder with data set #143
- testCommentLinkBuilder with data set #144
- testCommentLinkBuilder with data set #145
- testCommentLinkBuilder with data set #146
- testCommentLinkBuilder with data set #147
- testCommentLinkBuilder with data set #148
- testCommentLinkBuilder with data set #149
- testCommentLinkBuilder with data set #150
- testCommentLinkBuilder with data set #151
- testCommentLinkBuilder with data set #152
- testCommentLinkBuilder with data set #153
- testCommentLinkBuilder with data set #154
- testCommentLinkBuilder with data set #155
- testCommentLinkBuilder with data set #156
- testCommentLinkBuilder with data set #157
- testCommentLinkBuilder with data set #158
- testCommentLinkBuilder with data set #159
- testCommentLinkBuilder with data set #160
- testCommentLinkBuilder with data set #161
- testCommentLinkBuilder with data set #162
- testCommentLinkBuilder with data set #163
- testCommentLinkBuilder with data set #164
- testCommentLinkBuilder with data set #165
- testCommentLinkBuilder with data set #166
- testCommentLinkBuilder with data set #167
- testCommentLinkBuilder with data set #168
- testCommentLinkBuilder with data set #169
- testCommentLinkBuilder with data set #170
- testCommentLinkBuilder with data set #171
- testCommentLinkBuilder with data set #172
- testCommentLinkBuilder with data set #173
- testCommentLinkBuilder with data set #174
- testCommentLinkBuilder with data set #175
- testCommentLinkBuilder with data set #176
- testCommentLinkBuilder with data set #177
- testCommentLinkBuilder with data set #178
- testCommentLinkBuilder with data set #179
- testCommentLinkBuilder with data set #180
- testCommentLinkBuilder with data set #181
- testCommentLinkBuilder with data set #182
- testCommentLinkBuilder with data set #183
- testCommentLinkBuilder with data set #184
- testCommentLinkBuilder with data set #185
- testCommentLinkBuilder with data set #186
- testCommentLinkBuilder with data set #187
- testCommentLinkBuilder with data set #188
- testCommentLinkBuilder with data set #189
- testCommentLinkBuilder with data set #190
- testCommentLinkBuilder with data set #191
- testCommentLinkBuilder with data set #192
- testCommentLinkBuilder with data set #193
- testCommentLinkBuilder with data set #194
- testCommentLinkBuilder with data set #195
- testCommentLinkBuilder with data set #196
- testCommentLinkBuilder with data set #197
- testCommentLinkBuilder with data set #198
- testCommentLinkBuilder with data set #199
- testCommentLinkBuilder with data set #200
- testCommentLinkBuilder with data set #201
- testCommentLinkBuilder with data set #202
- testCommentLinkBuilder with data set #203
- testCommentLinkBuilder with data set #204
- testCommentLinkBuilder with data set #205
- testCommentLinkBuilder with data set #206
- testCommentLinkBuilder with data set #207
- testCommentLinkBuilder with data set #208
- testCommentLinkBuilder with data set #209
- testCommentLinkBuilder with data set #210
- testCommentLinkBuilder with data set #211
- testCommentLinkBuilder with data set #212
- testCommentLinkBuilder with data set #213
- testCommentLinkBuilder with data set #214
- testCommentLinkBuilder with data set #215
- testCommentLinkBuilder with data set #216
- testCommentLinkBuilder with data set #217
- testCommentLinkBuilder with data set #218
- testCommentLinkBuilder with data set #219
- testCommentLinkBuilder with data set #220
- testCommentLinkBuilder with data set #221
- testCommentLinkBuilder with data set #222
- testCommentLinkBuilder with data set #223
- testCommentLinkBuilder with data set #224
- testCommentLinkBuilder with data set #225
- testCommentLinkBuilder with data set #226
- testCommentLinkBuilder with data set #227
- testCommentLinkBuilder with data set #228
- testCommentLinkBuilder with data set #229
- testCommentLinkBuilder with data set #230
- testCommentLinkBuilder with data set #231
- testCommentLinkBuilder with data set #232
- testCommentLinkBuilder with data set #233
- testCommentLinkBuilder with data set #234
- testCommentLinkBuilder with data set #235
- testCommentLinkBuilder with data set #236
- testCommentLinkBuilder with data set #237
- testCommentLinkBuilder with data set #238
- testCommentLinkBuilder with data set #239
- testCommentLinkBuilder with data set #240
- testCommentLinkBuilder with data set #241
- testCommentLinkBuilder with data set #242
- testCommentLinkBuilder with data set #243
- testCommentLinkBuilder with data set #244
- testCommentLinkBuilder with data set #245
- testCommentLinkBuilder with data set #246
- testCommentLinkBuilder with data set #247
- testCommentLinkBuilder with data set #248
- testCommentLinkBuilder with data set #249
- testCommentLinkBuilder with data set #250
- testCommentLinkBuilder with data set #251
- testCommentLinkBuilder with data set #252
- testCommentLinkBuilder with data set #253
- testCommentLinkBuilder with data set #254
- testCommentLinkBuilder with data set #255
- testCommentLinkBuilder with data set #256
- testCommentLinkBuilder with data set #257
- testCommentLinkBuilder with data set #258
- testCommentLinkBuilder with data set #259
- testCommentLinkBuilder with data set #260
- testCommentLinkBuilder with data set #261
- testCommentLinkBuilder with data set #262
- testCommentLinkBuilder with data set #263
- testCommentLinkBuilder with data set #264
- testCommentLinkBuilder with data set #265
- testCommentLinkBuilder with data set #266
- testCommentLinkBuilder with data set #267
- testCommentLinkBuilder with data set #268
- testCommentLinkBuilder with data set #269
- testCommentLinkBuilder with data set #270
- testCommentLinkBuilder with data set #271
- testCommentLinkBuilder with data set #272
- testCommentLinkBuilder with data set #273
- testCommentLinkBuilder with data set #274
- testCommentLinkBuilder with data set #275
- testCommentLinkBuilder with data set #276
- testCommentLinkBuilder with data set #277
- testCommentLinkBuilder with data set #278
- testCommentLinkBuilder with data set #279
- testCommentLinkBuilder with data set #280
- testCommentLinkBuilder with data set #281
- testCommentLinkBuilder with data set #282
- testCommentLinkBuilder with data set #283
- testCommentLinkBuilder with data set #284
- testCommentLinkBuilder with data set #285
- testCommentLinkBuilder with data set #286
- testCommentLinkBuilder with data set #287
- testCommentLinkBuilder with data set #288
- testCommentLinkBuilder with data set #289
- testCommentLinkBuilder with data set #290
- testCommentLinkBuilder with data set #291
- testCommentLinkBuilder with data set #292
- testCommentLinkBuilder with data set #293
- testCommentLinkBuilder with data set #294
- testCommentLinkBuilder with data set #295
- testCommentLinkBuilder with data set #296
- testCommentLinkBuilder with data set #297
- testCommentLinkBuilder with data set #298
- testCommentLinkBuilder with data set #299
- testCommentLinkBuilder with data set #300
- testCommentLinkBuilder with data set #301
- testCommentLinkBuilder with data set #302
- testCommentLinkBuilder with data set #303
- testCommentLinkBuilder with data set #304
- testCommentLinkBuilder with data set #305
- testCommentLinkBuilder with data set #306
- testCommentLinkBuilder with data set #307
- testCommentLinkBuilder with data set #308
- testCommentLinkBuilder with data set #309
- testCommentLinkBuilder with data set #310
- testCommentLinkBuilder with data set #311
- testCommentLinkBuilder with data set #312
- testCommentLinkBuilder with data set #313
- testCommentLinkBuilder with data set #314
- testCommentLinkBuilder with data set #315
- testCommentLinkBuilder with data set #316
- testCommentLinkBuilder with data set #317
- testCommentLinkBuilder with data set #318
- testCommentLinkBuilder with data set #319
- testCommentLinkBuilder with data set #320
- testCommentLinkBuilder with data set #321
- testCommentLinkBuilder with data set #322
- testCommentLinkBuilder with data set #323
- testCommentLinkBuilder with data set #324
- testCommentLinkBuilder with data set #325
- testCommentLinkBuilder with data set #326
- testCommentLinkBuilder with data set #327
- testCommentLinkBuilder with data set #328
- testCommentLinkBuilder with data set #329
- testCommentLinkBuilder with data set #330
- testCommentLinkBuilder with data set #331
- testCommentLinkBuilder with data set #332
- testCommentLinkBuilder with data set #333
- testCommentLinkBuilder with data set #334
- testCommentLinkBuilder with data set #335
- testCommentLinkBuilder with data set #336
- testCommentLinkBuilder with data set #337
- testCommentLinkBuilder with data set #338
- testCommentLinkBuilder with data set #339
- testCommentLinkBuilder with data set #340
- testCommentLinkBuilder with data set #341
- testCommentLinkBuilder with data set #342
- testCommentLinkBuilder with data set #343
- testCommentLinkBuilder with data set #344
- testCommentLinkBuilder with data set #345
- testCommentLinkBuilder with data set #346
- testCommentLinkBuilder with data set #347
- testCommentLinkBuilder with data set #348
- testCommentLinkBuilder with data set #349
- testCommentLinkBuilder with data set #350
- testCommentLinkBuilder with data set #351
- testCommentLinkBuilder with data set #352
- testCommentLinkBuilder with data set #353
- testCommentLinkBuilder with data set #354
- testCommentLinkBuilder with data set #355
- testCommentLinkBuilder with data set #356
- testCommentLinkBuilder with data set #357
- testCommentLinkBuilder with data set #358
- testCommentLinkBuilder with data set #359
- testCommentLinkBuilder with data set #360
- testCommentLinkBuilder with data set #361
- testCommentLinkBuilder with data set #362
- testCommentLinkBuilder with data set #363
- testCommentLinkBuilder with data set #364
- testCommentLinkBuilder with data set #365
- testCommentLinkBuilder with data set #366
- testCommentLinkBuilder with data set #367
- testCommentLinkBuilder with data set #368
- testCommentLinkBuilder with data set #369
- testCommentLinkBuilder with data set #370
- testCommentLinkBuilder with data set #371
- testCommentLinkBuilder with data set #372
- testCommentLinkBuilder with data set #373
- testCommentLinkBuilder with data set #374
- testCommentLinkBuilder with data set #375
- testCommentLinkBuilder with data set #376
- testCommentLinkBuilder with data set #377
- testCommentLinkBuilder with data set #378
- testCommentLinkBuilder with data set #379
- testCommentLinkBuilder with data set #380
- testCommentLinkBuilder with data set #381
- testCommentLinkBuilder with data set #382
- testCommentLinkBuilder with data set #383
- testCommentLinkBuilder with data set #384
- testCommentLinkBuilder with data set #385
- testCommentLinkBuilder with data set #386
- testCommentLinkBuilder with data set #387
- testCommentLinkBuilder with data set #388
- testCommentLinkBuilder with data set #389
- testCommentLinkBuilder with data set #390
- testCommentLinkBuilder with data set #391
- testCommentLinkBuilder with data set #392
- testCommentLinkBuilder with data set #393
- testCommentLinkBuilder with data set #394
- testCommentLinkBuilder with data set #395
- testCommentLinkBuilder with data set #396
- testCommentLinkBuilder with data set #397
- testCommentLinkBuilder with data set #398
- testCommentLinkBuilder with data set #399
- testCommentLinkBuilder with data set #400
- testCommentLinkBuilder with data set #401
- testCommentLinkBuilder with data set #402
- testCommentLinkBuilder with data set #403
- testCommentLinkBuilder with data set #404
- testCommentLinkBuilder with data set #405
- testCommentLinkBuilder with data set #406
- testCommentLinkBuilder with data set #407
- testCommentLinkBuilder with data set #408
- testCommentLinkBuilder with data set #409
- testCommentLinkBuilder with data set #410
- testCommentLinkBuilder with data set #411
- testCommentLinkBuilder with data set #412
- testCommentLinkBuilder with data set #413
- testCommentLinkBuilder with data set #414
- testCommentLinkBuilder with data set #415
- testCommentLinkBuilder with data set #416
- testCommentLinkBuilder with data set #417
- testCommentLinkBuilder with data set #418
- testCommentLinkBuilder with data set #419
- testCommentLinkBuilder with data set #420
- testCommentLinkBuilder with data set #421
- testCommentLinkBuilder with data set #422
- testCommentLinkBuilder with data set #423
- testCommentLinkBuilder with data set #424
- testCommentLinkBuilder with data set #425
- testCommentLinkBuilder with data set #426
- testCommentLinkBuilder with data set #427
- testCommentLinkBuilder with data set #428
- testCommentLinkBuilder with data set #429
- testCommentLinkBuilder with data set #430
- testCommentLinkBuilder with data set #431
- testCommentLinkBuilder with data set #432
- testCommentLinkBuilder with data set #433
- testCommentLinkBuilder with data set #434
- testCommentLinkBuilder with data set #435
- testCommentLinkBuilder with data set #436
- testCommentLinkBuilder with data set #437
- testCommentLinkBuilder with data set #438
- testCommentLinkBuilder with data set #439
- testCommentLinkBuilder with data set #440
- testCommentLinkBuilder with data set #441
- testCommentLinkBuilder with data set #442
- testCommentLinkBuilder with data set #443
- testCommentLinkBuilder with data set #444
- testCommentLinkBuilder with data set #445
- testCommentLinkBuilder with data set #446
- testCommentLinkBuilder with data set #447
- testCommentLinkBuilder with data set #448
- testCommentLinkBuilder with data set #449
- testCommentLinkBuilder with data set #450
- testCommentLinkBuilder with data set #451
- testCommentLinkBuilder with data set #452
- testCommentLinkBuilder with data set #453
- testCommentLinkBuilder with data set #454
- testCommentLinkBuilder with data set #455
- testCommentLinkBuilder with data set #456
- testCommentLinkBuilder with data set #457
- testCommentLinkBuilder with data set #458
- testCommentLinkBuilder with data set #459
- testCommentLinkBuilder with data set #460
- testCommentLinkBuilder with data set #461
- testCommentLinkBuilder with data set #462
- testCommentLinkBuilder with data set #463
- testCommentLinkBuilder with data set #464
- testCommentLinkBuilder with data set #465
- testCommentLinkBuilder with data set #466
- testCommentLinkBuilder with data set #467
- testCommentLinkBuilder with data set #468
- testCommentLinkBuilder with data set #469
- testCommentLinkBuilder with data set #470
- testCommentLinkBuilder with data set #471
- testCommentLinkBuilder with data set #472
- testCommentLinkBuilder with data set #473
- testCommentLinkBuilder with data set #474
- testCommentLinkBuilder with data set #475
- testCommentLinkBuilder with data set #476
- testCommentLinkBuilder with data set #477
- testCommentLinkBuilder with data set #478
- testCommentLinkBuilder with data set #479
- testCommentLinkBuilder with data set #480
- testCommentLinkBuilder with data set #481
- testCommentLinkBuilder with data set #482
- testCommentLinkBuilder with data set #483
- testCommentLinkBuilder with data set #484
- testCommentLinkBuilder with data set #485
- testCommentLinkBuilder with data set #486
- testCommentLinkBuilder with data set #487
- testCommentLinkBuilder with data set #488
- testCommentLinkBuilder with data set #489
- testCommentLinkBuilder with data set #490
- testCommentLinkBuilder with data set #491
- testCommentLinkBuilder with data set #492
- testCommentLinkBuilder with data set #493
- testCommentLinkBuilder with data set #494
- testCommentLinkBuilder with data set #495
- testCommentLinkBuilder with data set #496
- testCommentLinkBuilder with data set #497
- testCommentLinkBuilder with data set #498
- testCommentLinkBuilder with data set #499
- testCommentLinkBuilder with data set #500
- testCommentLinkBuilder with data set #501
- testCommentLinkBuilder with data set #502
- testCommentLinkBuilder with data set #503
- testCommentLinkBuilder with data set #504
- testCommentLinkBuilder with data set #505
- testCommentLinkBuilder with data set #506
- testCommentLinkBuilder with data set #507
- testCommentLinkBuilder with data set #508
- testCommentLinkBuilder with data set #509
- testCommentLinkBuilder with data set #510
- testCommentLinkBuilder with data set #511
- testCommentLinkBuilder with data set #512
- testCommentLinkBuilder with data set #513
- testCommentLinkBuilder with data set #514
- testCommentLinkBuilder with data set #515
- testCommentLinkBuilder with data set #516
- testCommentLinkBuilder with data set #517
- testCommentLinkBuilder with data set #518
- testCommentLinkBuilder with data set #519
- testCommentLinkBuilder with data set #520
- testCommentLinkBuilder with data set #521
- testCommentLinkBuilder with data set #522
- testCommentLinkBuilder with data set #523
- testCommentLinkBuilder with data set #524
- testCommentLinkBuilder with data set #525
- testCommentLinkBuilder with data set #526
- testCommentLinkBuilder with data set #527
- testCommentLinkBuilder with data set #528
- testCommentLinkBuilder with data set #529
- testCommentLinkBuilder with data set #530
- testCommentLinkBuilder with data set #531
- testCommentLinkBuilder with data set #532
- testCommentLinkBuilder with data set #533
- testCommentLinkBuilder with data set #534
- testCommentLinkBuilder with data set #535
- testCommentLinkBuilder with data set #536
- testCommentLinkBuilder with data set #537
- testCommentLinkBuilder with data set #538
- testCommentLinkBuilder with data set #539
- testCommentLinkBuilder with data set #540
- testCommentLinkBuilder with data set #541
- testCommentLinkBuilder with data set #542
- testCommentLinkBuilder with data set #543
- testCommentLinkBuilder with data set #544
- testCommentLinkBuilder with data set #545
- testCommentLinkBuilder with data set #546
- testCommentLinkBuilder with data set #547
- testCommentLinkBuilder with data set #548
- testCommentLinkBuilder with data set #549
- testCommentLinkBuilder with data set #550
- testCommentLinkBuilder with data set #551
- testCommentLinkBuilder with data set #552
- testCommentLinkBuilder with data set #553
- testCommentLinkBuilder with data set #554
- testCommentLinkBuilder with data set #555
- testCommentLinkBuilder with data set #556
- testCommentLinkBuilder with data set #557
- testCommentLinkBuilder with data set #558
- testCommentLinkBuilder with data set #559
- testCommentLinkBuilder with data set #560
- testCommentLinkBuilder with data set #561
- testCommentLinkBuilder with data set #562
- testCommentLinkBuilder with data set #563
- testCommentLinkBuilder with data set #564
- testCommentLinkBuilder with data set #565
- testCommentLinkBuilder with data set #566
- testCommentLinkBuilder with data set #567
- testCommentLinkBuilder with data set #568
- testCommentLinkBuilder with data set #569
- testCommentLinkBuilder with data set #570
- testCommentLinkBuilder with data set #571
- testCommentLinkBuilder with data set #572
- testCommentLinkBuilder with data set #573
- testCommentLinkBuilder with data set #574
- testCommentLinkBuilder with data set #575
- testCommentLinkBuilder with data set #576
- testCommentLinkBuilder with data set #577
- testCommentLinkBuilder with data set #578
- testCommentLinkBuilder with data set #579
1Comment.Drupal\Tests\comment\Unit\CommentManagerTest
- testGetFields
1Comment.Drupal\Tests\comment\Unit\CommentStatisticsUnitTest
- testRead
1Comment.Drupal\Tests\comment\Unit\Entity\CommentLockTest
- testLocks
3Comment.Drupal\Tests\comment\Unit\Migrate\d6\CommentSourceWithHighWaterTest
- testRetrieval
- testSourceCount
- testSourceId
3Comment.Drupal\Tests\comment\Unit\Migrate\d6\CommentTest
- testRetrieval
- testSourceCount
- testSourceId
3Comment.Drupal\Tests\comment\Unit\Migrate\d6\CommentVariablePerCommentTypeTest
- testRetrieval
- testSourceCount
- testSourceId
3Comment.Drupal\Tests\comment\Unit\Migrate\d6\CommentVariableTest
- testRetrieval
- testSourceCount
- testSourceId
3Comment.Drupal\Tests\comment\Unit\Migrate\d7\CommentTest
- testRetrieval
- testSourceCount
- testSourceId
3Comment.Drupal\Tests\comment\Unit\Migrate\d7\CommentTypeTest
- testRetrieval
- testSourceCount
- testSourceId
1861Common.Common
21Common.Drupal\system\Tests\Common\RenderWebTest
testWrapperFormatCacheContext
fail: [Other] Line 29 of core/modules/system/src/Tests/Common/RenderWebTest.php:
Value 0 is identical to value 273.
- impletest_script_run_one_test
- testDrupalRenderFormElements
117Common.Drupal\Tests\Component\Utility\HtmlTest
- testTransformRootRelativeUrlsToAbsolute with data set "sd0jvace, srcset, /: root-relative"
- testTransformRootRelativeUrlsToAbsolute with data set "sd0jvace, srcset, /: protocol-relative"
- testTransformRootRelativeUrlsToAbsolute with data set "sd0jvace, srcset, /: absolute"
- testTransformRootRelativeUrlsToAbsolute with data set "sd0jvace, href, /: root-relative"
- testTransformRootRelativeUrlsToAbsolute with data set "sd0jvace, href, /: protocol-relative"
- testTransformRootRelativeUrlsToAbsolute with data set "sd0jvace, href, /: absolute"
- testTransformRootRelativeUrlsToAbsolute with data set "sd0jvace, poster, /: root-relative"
- testTransformRootRelativeUrlsToAbsolute with data set "sd0jvace, poster, /: protocol-relative"
- testTransformRootRelativeUrlsToAbsolute with data set "sd0jvace, poster, /: absolute"
- testTransformRootRelativeUrlsToAbsolute with data set "sd0jvace, src, /: root-relative"
- testTransformRootRelativeUrlsToAbsolute with data set "sd0jvace, src, /: protocol-relative"
- testTransformRootRelativeUrlsToAbsolute with data set "sd0jvace, src, /: absolute"
- testTransformRootRelativeUrlsToAbsolute with data set "sd0jvace, cite, /: root-relative"
- testTransformRootRelativeUrlsToAbsolute with data set "sd0jvace, cite, /: protocol-relative"
- testTransformRootRelativeUrlsToAbsolute with data set "sd0jvace, cite, /: absolute"
- testTransformRootRelativeUrlsToAbsolute with data set "sd0jvace, data, /: root-relative"
- testTransformRootRelativeUrlsToAbsolute with data set "sd0jvace, data, /: protocol-relative"
- testTransformRootRelativeUrlsToAbsolute with data set "sd0jvace, data, /: absolute"
- testTransformRootRelativeUrlsToAbsolute with data set "sd0jvace, action, /: root-relative"
- testTransformRootRelativeUrlsToAbsolute with data set "sd0jvace, action, /: protocol-relative"
- testTransformRootRelativeUrlsToAbsolute with data set "sd0jvace, action, /: absolute"
- testTransformRootRelativeUrlsToAbsolute with data set "sd0jvace, formaction, /: root-relative"
- testTransformRootRelativeUrlsToAbsolute with data set "sd0jvace, formaction, /: protocol-relative"
- testTransformRootRelativeUrlsToAbsolute with data set "sd0jvace, formaction, /: absolute"
- testTransformRootRelativeUrlsToAbsolute with data set "sd0jvace, about, /: root-relative"
- testTransformRootRelativeUrlsToAbsolute with data set "sd0jvace, about, /: protocol-relative"
- testTransformRootRelativeUrlsToAbsolute with data set "sd0jvace, about, /: absolute"
- testTransformRootRelativeUrlsToAbsolute with data set "sd0jvace, srcset, /subdir/jNUccTrj/: root-relative"
- testTransformRootRelativeUrlsToAbsolute with data set "sd0jvace, srcset, /subdir/jNUccTrj/: protocol-relative"
- testTransformRootRelativeUrlsToAbsolute with data set "sd0jvace, srcset, /subdir/jNUccTrj/: absolute"
- testTransformRootRelativeUrlsToAbsolute with data set "sd0jvace, href, /subdir/jNUccTrj/: root-relative"
- testTransformRootRelativeUrlsToAbsolute with data set "sd0jvace, href, /subdir/jNUccTrj/: protocol-relative"
- testTransformRootRelativeUrlsToAbsolute with data set "sd0jvace, href, /subdir/jNUccTrj/: absolute"
- testTransformRootRelativeUrlsToAbsolute with data set "sd0jvace, poster, /subdir/jNUccTrj/: root-relative"
- testTransformRootRelativeUrlsToAbsolute with data set "sd0jvace, poster, /subdir/jNUccTrj/: protocol-relative"
- testTransformRootRelativeUrlsToAbsolute with data set "sd0jvace, poster, /subdir/jNUccTrj/: absolute"
- testTransformRootRelativeUrlsToAbsolute with data set "sd0jvace, src, /subdir/jNUccTrj/: root-relative"
- testTransformRootRelativeUrlsToAbsolute with data set "sd0jvace, src, /subdir/jNUccTrj/: protocol-relative"
- testTransformRootRelativeUrlsToAbsolute with data set "sd0jvace, src, /subdir/jNUccTrj/: absolute"
- testTransformRootRelativeUrlsToAbsolute with data set "sd0jvace, cite, /subdir/jNUccTrj/: root-relative"
- testTransformRootRelativeUrlsToAbsolute with data set "sd0jvace, cite, /subdir/jNUccTrj/: protocol-relative"
- testTransformRootRelativeUrlsToAbsolute with data set "sd0jvace, cite, /subdir/jNUccTrj/: absolute"
- testTransformRootRelativeUrlsToAbsolute with data set "sd0jvace, data, /subdir/jNUccTrj/: root-relative"
- testTransformRootRelativeUrlsToAbsolute with data set "sd0jvace, data, /subdir/jNUccTrj/: protocol-relative"
- testTransformRootRelativeUrlsToAbsolute with data set "sd0jvace, data, /subdir/jNUccTrj/: absolute"
- testTransformRootRelativeUrlsToAbsolute with data set "sd0jvace, action, /subdir/jNUccTrj/: root-relative"
- testTransformRootRelativeUrlsToAbsolute with data set "sd0jvace, action, /subdir/jNUccTrj/: protocol-relative"
- testTransformRootRelativeUrlsToAbsolute with data set "sd0jvace, action, /subdir/jNUccTrj/: absolute"
- testTransformRootRelativeUrlsToAbsolute with data set "sd0jvace, formaction, /subdir/jNUccTrj/: root-relative"
- testTransformRootRelativeUrlsToAbsolute with data set "sd0jvace, formaction, /subdir/jNUccTrj/: protocol-relative"
- testTransformRootRelativeUrlsToAbsolute with data set "sd0jvace, formaction, /subdir/jNUccTrj/: absolute"
- testTransformRootRelativeUrlsToAbsolute with data set "sd0jvace, about, /subdir/jNUccTrj/: root-relative"
- testTransformRootRelativeUrlsToAbsolute with data set "sd0jvace, about, /subdir/jNUccTrj/: protocol-relative"
- testTransformRootRelativeUrlsToAbsolute with data set "sd0jvace, about, /subdir/jNUccTrj/: absolute"
- testCleanCssIdentifier with data set #0
- testCleanCssIdentifier with data set #1
- testCleanCssIdentifier with data set #2
- testCleanCssIdentifier with data set #3
- testCleanCssIdentifier with data set #4
- testCleanCssIdentifier with data set #5
- testCleanCssIdentifier with data set #6
- testCleanCssIdentifier with data set #7
- testHtmlClass
- testHtmlGetUniqueId with data set #0
- testHtmlGetUniqueId with data set #1
- testHtmlGetUniqueId with data set #2
- testHtmlGetUniqueId with data set #3
- testHtmlGetUniqueId with data set #4
- testHtmlGetUniqueId with data set #5
- testHtmlGetUniqueIdWithAjaxIds with data set #0
- testHtmlGetUniqueIdWithAjaxIds with data set #1
- testHtmlGetUniqueIdWithAjaxIds with data set #2
- testHtmlGetId with data set #0
- testHtmlGetId with data set #1
- testHtmlGetId with data set #2
- testHtmlGetId with data set #3
- testHtmlGetId with data set #4
- testDecodeEntities with data set #0
- testDecodeEntities with data set #1
- testDecodeEntities with data set #2
- testDecodeEntities with data set #3
- testDecodeEntities with data set #4
- testDecodeEntities with data set #5
- testDecodeEntities with data set #6
- testDecodeEntities with data set #7
- testDecodeEntities with data set #8
- testDecodeEntities with data set #9
- testDecodeEntities with data set #10
- testDecodeEntities with data set #11
- testDecodeEntities with data set #12
- testDecodeEntities with data set #13
- testDecodeEntities with data set #14
- testDecodeEntities with data set #15
- testDecodeEntities with data set #16
- testDecodeEntities with data set #17
- testDecodeEntities with data set #18
- testDecodeEntities with data set #19
- testDecodeEntities with data set #20
- testEscape with data set #0
- testEscape with data set #1
- testEscape with data set #2
- testEscape with data set #3
- testEscape with data set #4
- testEscape with data set #5
- testEscape with data set #6
- testEscape with data set #7
- testEscape with data set #8
- testEscape with data set #9
- testEscape with data set #10
- testEscape with data set #11
- testEscape with data set #12
- testDecodeEntitiesAndEscape
- testSerialize
- testTransformRootRelativeUrlsToAbsoluteAssertion with data set "only relative path"
- testTransformRootRelativeUrlsToAbsoluteAssertion with data set "only root-relative path"
- testTransformRootRelativeUrlsToAbsoluteAssertion with data set "host and path"
- testTransformRootRelativeUrlsToAbsoluteAssertion with data set "scheme, host and path"
20Common.Drupal\KernelTests\Core\Asset\AttachedAssetsTest
- testDefault
- testLibraryUnknown
- testAddFiles
- testAddJsSettings
- testAddExternalFiles
- testAttributes
- testAggregatedAttributes
- testAggregation
- testSettings
- testHeaderHTML
- testNoCache
- testBrowserConditionalComments
- testVersionQueryString
- testRenderOrder
- testRenderDifferentWeight
- testAlter
- testLibraryAlter
- testDynamicLibrary
- testLibraryNameConflicts
- testAddJsFileWithQueryString
2Common.Drupal\KernelTests\Core\Common\SizeTest
- testCommonFormatSize
- testCommonParseSizeFormatSize
2Common.Drupal\KernelTests\Core\Common\XssUnitTest
- testT
- testBadProtocolStripping
4Common.Drupal\KernelTests\Core\Render\Element\RenderElementTypesTest
- testContainer
- testHtmlTag
- testMoreLink
- testSystemCompactLink
1Common.Drupal\KernelTests\Core\Render\Element\TableSortExtenderTest
- testTableSortInit
2Common.Drupal\KernelTests\Core\Render\RenderTest
- testDrupalRenderThemePreprocessAttached
- testProcessAttached
2Common.Drupal\system\Tests\Common\AddFeedTest
- testBasicFeedAddNoTitle
- testFeedIconEscaping
2Common.Drupal\system\Tests\Common\AlterTest
- impletest_script_run_one_test
- testDrupalAlter
2Common.Drupal\system\Tests\Common\EarlyRenderingControllerTest
- impletest_script_run_one_test
- testEarlyRendering
3Common.Drupal\system\Tests\Common\FormatDateTest
- setUp
- testAdminDefinedFormatDate
- testFormatDate
1Common.Drupal\system\Tests\Common\NoJavaScriptAnonymousTest
- testNoJavaScript
2Common.Drupal\system\Tests\Common\SimpleTestErrorCollectorTest
- impletest_script_run_one_test
- testErrorCollect
9Common.Drupal\system\Tests\Common\UrlTest
- impletest_script_run_one_test
- testLinkXSS
- testLinkBubbleableMetadata
- testLinkAttributes
- Drupal\system\Tests\Common\{closure}
- testLinkRenderArrayText
- testDrupalGetQueryParameters
- testDrupalParseUrl
- testExternalUrls
11Common.Drupal\Tests\Core\Common\AttributesTest
- testDrupalAttributes with data set #0
- testDrupalAttributes with data set #1
- testDrupalAttributes with data set #2
- testDrupalAttributes with data set #3
- testDrupalAttributes with data set #4
- testDrupalAttributes with data set #5
- testDrupalAttributes with data set #6
- testDrupalAttributes with data set #7
- testDrupalAttributes with data set #8
- testAttributeIteration
- testAttributeValueBaseCopy
1Common.Drupal\Tests\Core\Common\DiffArrayTest
- testDiffAssocRecursive
1Common.Drupal\Tests\Core\Common\TagsTest
- testImplodeTags
2Common.Drupal\Tests\system\Kernel\Common\SystemListingTest
- testDirectoryPrecedence
- testFileScanIgnoreDirectory
41Contextual.Contextual
21Contextual.Drupal\contextual\Tests\ContextualDynamicContextTest
testDifferentPermissions
fail: [Other] Line 98 of core/modules/contextual/src/Tests/ContextualDynamicContextTest.php:
Value '





Edit


' is identical to value 'Edit'.

fail: [Other] Line 100 of core/modules/contextual/src/Tests/ContextualDynamicContextTest.php:
Value '





Edit


' is identical to value 'Edit'.
- setUp
- renderContextualLinks
2Contextual.Drupal\Tests\contextual\Kernel\ContextualUnitTest
- testContextualLinksToId
- testContextualIdToLinks
2262Editor.Editor
12Editor.Drupal\editor\Tests\QuickEditIntegrationLoadingTest
testUsersWithoutPermission
fail: [Other] Line 85 of core/modules/editor/src/Tests/QuickEditIntegrationLoadingTest.php:
Raw "Do you also love Drupal?Druplicon" found

fail: [Other] Line 85 of core/modules/editor/src/Tests/QuickEditIntegrationLoadingTest.php:
Raw "Do you also love Drupal?Druplicon" found

fail: [Other] Line 85 of core/modules/editor/src/Tests/QuickEditIntegrationLoadingTest.php:
Raw "Do you also love Drupal?Druplicon" found
testUserWithPermission
fail: [Other] Line 103 of core/modules/editor/src/Tests/QuickEditIntegrationLoadingTest.php:
Raw "Do you also love Drupal?Druplicon" found
- setUp
7Editor.Drupal\editor\Tests\EditorAdminTest
- setUp
- testNoEditorAvailable
- testAddEditorToExistingFormat
- selectUnicornEditor
- verifyUnicornEditorConfiguration
- addEditorToNewFormat
- testDisableFormatWithEditor
1Editor.Drupal\editor\Tests\EditorDialogAccessTest
- testEditorImageDialogAccess
3Editor.Drupal\editor\Tests\EditorLoadingTest
- setUp
- testLoading
- testSupportedElementTypes
1Editor.Drupal\editor\Tests\EditorPrivateFileReferenceFilterTest
- testEditorPrivateFileReferenceFilter
4Editor.Drupal\editor\Tests\EditorSecurityTest
- setUp
- testInitialSecurity
- testSwitchingSecurity
- testEditorXssFilterOverride
3Editor.Drupal\editor\Tests\EditorUploadImageScaleTest
- setUp
- testEditorUploadImageScale
- uploadImage
2Editor.Drupal\editor\Tests\Update\EditorUpdateTest
- testEditorUpdate8001
- runUpdates
1Editor.Drupal\Tests\editor\Kernel\EditorFileReferenceFilterTest
- testEditorFileReferenceFilter
1Editor.Drupal\Tests\editor\Kernel\EditorFileUsageTest
- testEditorEntityHooks
1Editor.Drupal\Tests\editor\Kernel\EditorFilterIntegrationTest
- testTextFormatIntegration
1Editor.Drupal\Tests\editor\Kernel\EditorImageDialogTest
- testEditorImageDialog
1Editor.Drupal\Tests\editor\Kernel\EditorManagerTest
- testManager
4Editor.Drupal\Tests\editor\Kernel\QuickEditIntegrationTest
- testEditorSelection
- testMetadata
- testAttachments
- testGetUntransformedTextCommand
1Editor.Drupal\Tests\editor\Unit\EditorConfigEntityUnitTest
- testCalculateDependencies
194Editor.Drupal\Tests\editor\Unit\EditorXssFilter\StandardTest
- testFilterXss with data set #0
- testFilterXss with data set #1
- testFilterXss with data set #2
- testFilterXss with data set #3
- testFilterXss with data set #4
- testFilterXss with data set #5
- testFilterXss with data set #6
- testFilterXss with data set #7
- testFilterXss with data set #8
- testFilterXss with data set #9
- testFilterXss with data set #10
- testFilterXss with data set #11
- testFilterXss with data set #12
- testFilterXss with data set #13
- testFilterXss with data set #14
- testFilterXss with data set #15
- testFilterXss with data set #16
- testFilterXss with data set #17
- testFilterXss with data set #18
- testFilterXss with data set #19
- testFilterXss with data set #20
- testFilterXss with data set #21
- testFilterXss with data set #22
- testFilterXss with data set #23
- testFilterXss with data set #24
- testFilterXss with data set #25
- testFilterXss with data set #26
- testFilterXss with data set #27
- testFilterXss with data set #28
- testFilterXss with data set #29
- testFilterXss with data set #30
- testFilterXss with data set #31
- testFilterXss with data set #32
- testFilterXss with data set #33
- testFilterXss with data set #34
- testFilterXss with data set #35
- testFilterXss with data set #36
- testFilterXss with data set #37
- testFilterXss with data set #38
- testFilterXss with data set #39
- testFilterXss with data set #40
- testFilterXss with data set #41
- testFilterXss with data set #42
- testFilterXss with data set #43
- testFilterXss with data set #44
- testFilterXss with data set #45
- testFilterXss with data set #46
- testFilterXss with data set #47
- testFilterXss with data set #48
- testFilterXss with data set #49
- testFilterXss with data set #50
- testFilterXss with data set #51
- testFilterXss with data set #52
- testFilterXss with data set #53
- testFilterXss with data set #54
- testFilterXss with data set #55
- testFilterXss with data set #56
- testFilterXss with data set #57
- testFilterXss with data set #58
- testFilterXss with data set #59
- testFilterXss with data set #60
- testFilterXss with data set #61
- testFilterXss with data set #62
- testFilterXss with data set #63
- testFilterXss with data set #64
- testFilterXss with data set #65
- testFilterXss with data set #66
- testFilterXss with data set #67
- testFilterXss with data set #68
- testFilterXss with data set #69
- testFilterXss with data set #70
- testFilterXss with data set #71
- testFilterXss with data set #72
- testFilterXss with data set #73
- testFilterXss with data set #74
- testFilterXss with data set #75
- testFilterXss with data set #76
- testFilterXss with data set #77
- testFilterXss with data set #78
- testFilterXss with data set #79
- testFilterXss with data set #80
- testFilterXss with data set #81
- testFilterXss with data set #82
- testFilterXss with data set #83
- testFilterXss with data set #84
- testFilterXss with data set #85
- testFilterXss with data set #86
- testFilterXss with data set #87
- testFilterXss with data set #88
- testFilterXss with data set #89
- testFilterXss with data set #90
- testFilterXss with data set #91
- testFilterXss with data set #92
- testFilterXss with data set #93
- testFilterXss with data set #94
- testFilterXss with data set #95
- testFilterXss with data set #96
- testFilterXss with data set #97
- testFilterXss with data set #98
- testFilterXss with data set #99
- testFilterXss with data set #100
- testFilterXss with data set #101
- testFilterXss with data set #102
- testFilterXss with data set #103
- testFilterXss with data set #104
- testFilterXss with data set #105
- testFilterXss with data set #106
- testFilterXss with data set #107
- testFilterXss with data set #108
- testFilterXss with data set #109
- testFilterXss with data set #110
- testFilterXss with data set #111
- testFilterXss with data set #112
- testFilterXss with data set #113
- testFilterXss with data set #114
- testFilterXss with data set #115
- testFilterXss with data set #116
- testFilterXss with data set #117
- testFilterXss with data set #118
- testFilterXss with data set #119
- testFilterXss with data set #120
- testFilterXss with data set #121
- testFilterXss with data set #122
- testFilterXss with data set #123
- testFilterXss with data set #124
- testFilterXss with data set #125
- testFilterXss with data set #126
- testFilterXss with data set #127
- testFilterXss with data set #128
- testFilterXss with data set #129
- testFilterXss with data set #130
- testFilterXss with data set #131
- testFilterXss with data set #132
- testFilterXss with data set #133
- testFilterXss with data set #134
- testFilterXss with data set #135
- testFilterXss with data set #136
- testFilterXss with data set #137
- testFilterXss with data set #138
- testFilterXss with data set #139
- testFilterXss with data set #140
- testFilterXss with data set #141
- testFilterXss with data set #142
- testFilterXss with data set #143
- testFilterXss with data set #144
- testFilterXss with data set #145
- testFilterXss with data set #146
- testFilterXss with data set #147
- testFilterXss with data set #148
- testFilterXss with data set #149
- testFilterXss with data set #150
- testFilterXss with data set #151
- testFilterXss with data set #152
- testFilterXss with data set #153
- testFilterXss with data set #154
- testFilterXss with data set #155
- testFilterXss with data set #156
- testFilterXss with data set #157
- testFilterXss with data set #158
- testFilterXss with data set #159
- testFilterXss with data set #160
- testFilterXss with data set #161
- testFilterXss with data set #162
- testFilterXss with data set #163
- testFilterXss with data set #164
- testFilterXss with data set #165
- testFilterXss with data set #166
- testFilterXss with data set #167
- testFilterXss with data set #168
- testFilterXss with data set #169
- testFilterXss with data set #170
- testFilterXss with data set #171
- testFilterXss with data set #172
- testFilterXss with data set #173
- testFilterXss with data set #174
- testFilterXss with data set #175
- testFilterXss with data set #176
- testFilterXss with data set #177
- testFilterXss with data set #178
- testFilterXss with data set #179
- testFilterXss with data set #180
- testFilterXss with data set #181
- testFilterXss with data set #182
- testFilterXss with data set #183
- testFilterXss with data set #184
- testFilterXss with data set #185
- testFilterXss with data set #186
- testFilterXss with data set #187
- testFilterXss with data set #188
- testFilterXss with data set #189
- testFilterXss with data set #190
- testBlacklistMode with data set #0
- testBlacklistMode with data set #1
- testBlacklistMode with data set #2
5971Entity.Entity
31Entity.Drupal\system\Tests\Entity\EntityViewControllerTest
testEntityViewController
fail: [Other] Line 54 of core/modules/system/src/Tests/Entity/EntityViewControllerTest.php:
Raw "
            uOA4aafT
      " found

fail: [Other] Line 54 of core/modules/system/src/Tests/Entity/EntityViewControllerTest.php:
Raw "
            rU5IBeuV
      " found

fail: [Other] Line 75 of core/modules/system/src/Tests/Entity/EntityViewControllerTest.php:
Raw "
            rev 2
      " found
- setUp
- testFieldItemAttributes
- testEntityViewControllerViewBuilder
1Entity.Drupal\KernelTests\Core\Entity\BundleConstraintValidatorTest
- testValidation
8Entity.Drupal\KernelTests\Core\Entity\ConfigEntityQueryTest
- testConfigEntityQuery
- testStringIdConditions
- testCount
- testSortRange
- testTableSort
- testDotted
- testCaseSensitivity
- testLookupKeys
2Entity.Drupal\KernelTests\Core\Entity\ContentEntityChangedTest
- testChanged
- testRevisionChanged
2Entity.Drupal\KernelTests\Core\Entity\ContentEntityCloneTest
- testFieldEntityReferenceAfterClone
- testEnforceIsNewOnClonedEntityTranslation
1Entity.Drupal\KernelTests\Core\Entity\ContentEntityFieldMethodInvocationOrderTest
- testFieldMethodInvocationOrder
3Entity.Drupal\KernelTests\Core\Entity\ContentEntityNonRevisionableFieldTest
- testMulNonRevisionableField
- testNonRevisionableField
- testMultiColumnNonRevisionableBaseField
2Entity.Drupal\KernelTests\Core\Entity\ContentEntityNullStorageTest
- testEntityQuery
- testDeleteThroughImport
1Entity.Drupal\KernelTests\Core\Entity\DefaultTableMappingIntegrationTest
- testGetFieldTableName
6Entity.Drupal\KernelTests\Core\Entity\EntityAccessControlHandlerTest
- testUserLabelAccess
- testEntityAccess
- testDefaultEntityAccess
- testEntityAccessDefaultController
- testEntityTranslationAccess
- testHooks
2Entity.Drupal\KernelTests\Core\Entity\EntityApiTest
- testCRUD
- testEntityStorageExceptionHandling
2Entity.Drupal\KernelTests\Core\Entity\EntityAutocompleteTest
- testEntityReferenceAutocompletion
- testSelectionSettingsHandling
1Entity.Drupal\KernelTests\Core\Entity\EntityBundleFieldTest
- testCustomBundleFieldUsage
8Entity.Drupal\KernelTests\Core\Entity\EntityCrudHookTest
- testBlockHooks
- testCommentHooks
- testFileHooks
- testNodeHooks
- testTaxonomyTermHooks
- testTaxonomyVocabularyHooks
- testUserHooks
- testEntityRollback
22Entity.Drupal\KernelTests\Core\Entity\EntityDefinitionUpdateTest
- testNewEntityType
- testNoUpdates
- testEntityTypeUpdateWithoutData
- testEntityTypeUpdateWithData
- testBaseFieldCreateUpdateDeleteWithoutData
- testBundleFieldCreateUpdateDeleteWithoutData
- testBaseFieldCreateDeleteWithExistingEntities
- testBundleFieldCreateDeleteWithExistingEntities
- testBaseFieldDeleteWithExistingData
- testBundleFieldDeleteWithExistingData
- testBaseFieldUpdateWithExistingData
- testBundleFieldUpdateWithExistingData
- testEntityIndexCreateDeleteWithoutData
- testEntityIndexCreateWithData
- testDefinitionEvents
- testEntityTypeSchemaUpdateAndBaseFieldCreateWithoutData
- testEntityTypeSchemaUpdateAndRevisionableBaseFieldCreateWithoutData
- testSingleActionCalls
- testCreateFieldAndIndexOnSharedTable
- testCreateIndexUsingEntityStorageSchemaWithData
- testBaseFieldEntityKeyUpdateWithExistingData
- testLongNameFieldIndexes
1Entity.Drupal\KernelTests\Core\Entity\EntityDisplayBaseTest
- testPreSave
1Entity.Drupal\KernelTests\Core\Entity\EntityDisplayFormBaseTest
- testCopyFormValuesToEntity
2Entity.Drupal\KernelTests\Core\Entity\EntityFieldDefaultValueTest
- testDefaultValues
- testDefaultValueCallback
10Entity.Drupal\KernelTests\Core\Entity\EntityFieldTest
- testReadWrite
- testSave
- testIntrospection
- testIterator
- testDataStructureInterfaces
- testDataTypes
- testBaseFieldNonExistingBaseField
- testFieldOverrideBundleField
- testEntityConstraintValidation
- testComputedProperties
1Entity.Drupal\KernelTests\Core\Entity\EntityNonRevisionableTranslatableFieldTest
- testTranslatingNonRevisionableField
1Entity.Drupal\KernelTests\Core\Entity\EntityQueryAggregateTest
- testAggregation
1Entity.Drupal\KernelTests\Core\Entity\EntityQueryRelationshipTest
- testQuery
11Entity.Drupal\KernelTests\Core\Entity\EntityQueryTest
- testEntityQuery
- testSort
- testTableSort
- testCount
- testNestedConditionGroups
- testDelta
- testMetaData
- testCaseSensitivity
- testBaseFieldMultipleColumns
- testForwardRevisions
- testInjectionInCondition
6Entity.Drupal\KernelTests\Core\Entity\EntityReferenceFieldTest
- testEntityReferenceFieldValidation
- testReferencedEntitiesMultipleLoad
- testReferencedEntitiesStringId
- testAutocreateApi
- testTargetEntityNoLoad
- testEntityReferenceFieldDependencies
3Entity.Drupal\KernelTests\Core\Entity\EntityRevisionTranslationTest
- testNewRevisionAfterTranslation
- testRevertRevisionAfterTranslation
- testTranslationValuesWhenSavingForwardRevisions
9Entity.Drupal\KernelTests\Core\Entity\EntityTranslationTest
- testEntityLanguageMethods
- testMultilingualProperties
- testEntityTranslationAPI
- testLanguageFallback
- testFieldDefinitions
- testLanguageChange
- testEntityAdapter
- testFieldEntityReference
- testDeleteEntityTranslation
2Entity.Drupal\KernelTests\Core\Entity\EntityTypeConstraintsTest
- testConstraintDefinition
- testConstraintValidation
1Entity.Drupal\KernelTests\Core\Entity\EntityTypeConstraintValidatorTest
- testValidation
3Entity.Drupal\KernelTests\Core\Entity\EntityTypedDataDefinitionTest
- testFields
- testEntities
- testEntityReferences
1Entity.Drupal\KernelTests\Core\Entity\EntityUUIDTest
- testCRUD
2Entity.Drupal\KernelTests\Core\Entity\EntityValidationTest
- testValidation
- testCompositeConstraintValidation
4Entity.Drupal\KernelTests\Core\Entity\EntityViewBuilderTest
- testEntityViewBuilderCache
- testEntityViewBuilderCacheWithReferences
- testEntityViewBuilderCacheToggling
- testEntityViewBuilderWeight
1Entity.Drupal\KernelTests\Core\Entity\EntityViewHookTest
- testHookEntityDisplayBuildAlter
8Entity.Drupal\KernelTests\Core\Entity\FieldSqlStorageTest
- testFieldLoad
- testFieldWrite
- testLongNames
- testUpdateFieldSchemaWithData
- testFieldUpdateFailure
- testFieldUpdateIndexesWithData
- testFieldSqlStorageForeignKeys
- testTableNames
1Entity.Drupal\KernelTests\Core\Entity\FieldTranslationSqlStorageTest
- testFieldSqlStorage
3Entity.Drupal\KernelTests\Core\Entity\FieldWidgetConstraintValidatorTest
- testValidation
- testValidationWithCompositeConstraint
- testEntityLevelConstraintValidation
1Entity.Drupal\KernelTests\Core\Entity\RevisionableContentEntityBaseTest
- testRevisionableContentEntity
2Entity.Drupal\KernelTests\Core\Entity\RouteProviderTest
- testHtmlRoutes
- testAdminHtmlRoutes
1Entity.Drupal\KernelTests\Core\Field\FieldAccessTest
- testFieldAccess
7Entity.Drupal\system\Tests\Entity\ConfigEntityImportTest
- setUp
- checkSinglePluginConfigSync
- doActionUpdate
- doBlockUpdate
- doFilterFormatUpdate
- doImageStyleUpdate
- doSearchPageUpdate
5Entity.Drupal\system\Tests\Entity\EntityFormTest
- setUp
- doTestFormCRUD
- doTestMultilingualFormCRUD
- testEntityFormDisplayAlter
- testValidationHandlers
4Entity.Drupal\system\Tests\Entity\EntityListBuilderTest
- setUp
- testPager
- testCacheContexts
- testCacheTags
3Entity.Drupal\system\Tests\Entity\EntityOperationsTest
- setUp
- createRole
- testEntityOperationAlter
3Entity.Drupal\system\Tests\Entity\EntityRevisionsTest
- setUp
- runRevisionsTests
- testEntityRevisionParamConverter
2Entity.Drupal\system\Tests\Entity\EntityTranslationFormTest
- setUp
- testEntityFormLanguage
2Entity.Drupal\system\Tests\Entity\Update\LangcodeToAsciiUpdateFilledTest
- testLangcodeColumnCollation
- runUpdates
2Entity.Drupal\system\Tests\Entity\Update\LangcodeToAsciiUpdateTest
- testLangcodeColumnCollation
- runUpdates
2Entity.Drupal\system\Tests\Entity\Update\SqlContentEntityStorageSchemaIndexFilledTest
- testIndex
- runUpdates
2Entity.Drupal\system\Tests\Entity\Update\SqlContentEntityStorageSchemaIndexTest
- testIndex
- runUpdates
5Entity.Drupal\system\Tests\Entity\Update\UpdateApiEntityDefinitionUpdateTest
- setUp
- testSingleUpdates
- applyUpdates
- testMultipleUpdates
- testStatusReport
2Entity.Drupal\system\Tests\Update\FilterHtmlUpdateTest
- testAllowedHtmlUpdate
- runUpdates
5Entity.Drupal\Tests\Core\Enhancer\EntityRevisionRouteEnhancerTest
- testApplies with data set "no-parameter"
- testApplies with data set "none-revision-parameters"
- testApplies with data set "with-revision-parameter"
- testEnhanceWithoutEntityRevision
- testEnhanceWithEntityRevision
16Entity.Drupal\Tests\Core\Entity\BaseFieldDefinitionTest
- testFieldName
- testFieldLabel
- testFieldDescription
- testFieldType
- testFieldSettings
- testDefaultFieldSettings
- testFieldDefaultValue
- testFieldTranslatable
- testFieldRevisionable
- testFieldCardinality
- testFieldRequired
- testFieldProvider
- testCustomStorage
- testDefaultValueCallback
- testInvalidDefaultValueCallback
- testNullDefaultValueCallback
20Entity.Drupal\Tests\Core\Entity\ContentEntityBaseUnitTest
- testIsNewRevision
- testSetNewRevisionException
- testIsDefaultRevision
- testGetRevisionId
- testIsTranslatable
- testIsTranslatableForMonolingual
- testPreSaveRevision
- testValidate
- testRequiredValidation
- testBundle
- testAccess
- testLabel
- testGet with data set #0
- testGet with data set #1
- testGet with data set #2
- testGetFields with data set #0
- testGetFields with data set #1
- testGetFields with data set #2
- testGetFields with data set #3
- testSet
1Entity.Drupal\Tests\Core\Entity\Enhancer\EntityRouteEnhancerTest
- testEnhancer
18Entity.Drupal\Tests\Core\Entity\EntityFieldManagerTest
- testGetBaseFieldDefinitions
- testGetFieldDefinitions
- testGetFieldStorageDefinitions
- testGetBaseFieldDefinitionsTranslatableEntityTypeDefaultLangcode with data set #0
- testGetBaseFieldDefinitionsTranslatableEntityTypeDefaultLangcode with data set #1
- testGetBaseFieldDefinitionsTranslatableEntityTypeLangcode with data set #0
- testGetBaseFieldDefinitionsTranslatableEntityTypeLangcode with data set #1
- testGetBaseFieldDefinitionsTranslatableEntityTypeLangcode with data set #2
- testGetBaseFieldDefinitionsWithCaching
- testGetFieldDefinitionsWithCaching
- testGetFieldStorageDefinitionsWithCaching
- testGetBaseFieldDefinitionsInvalidDefinition
- testGetFieldDefinitionsProvider
- testClearCachedFieldDefinitions
- testGetExtraFields
- testGetFieldMap
- testGetFieldMapFromCache
- testGetFieldMapByFieldType
1Entity.Drupal\Tests\Core\Entity\EntityFormBuilderTest
- testGetForm
10Entity.Drupal\Tests\Core\Entity\EntityFormTest
- testFormId with data set #0
- testFormId with data set #1
- testFormId with data set #2
- testFormId with data set #3
- testFormId with data set #4
- testCopyFormValuesToEntity
- testGetEntityFromRouteMatchEditDelete
- testGetEntityFromRouteMatchAdd
- testGetEntityFromRouteMatchAddStatic
- testGetEntityFromRouteMatchAddEntity
12Entity.Drupal\Tests\Core\Entity\EntityLinkTest
- testLink with data set #0
- testLink with data set #1
- testLink with data set #2
- testLink with data set #3
- testLink with data set #4
- testLink with data set #5
- testToLink with data set #0
- testToLink with data set #1
- testToLink with data set #2
- testToLink with data set #3
- testToLink with data set #4
- testToLink with data set #5
1Entity.Drupal\Tests\Core\Entity\EntityListBuilderTest
- testGetOperations
1Entity.Drupal\Tests\Core\Entity\EntityManagerTest
- testClearCachedDefinitions
1Entity.Drupal\Tests\Core\Entity\EntityRepositoryTest
- testGetTranslationFromContext
18Entity.Drupal\Tests\Core\Entity\EntityResolverManagerTest
- testSetRouteOptionsWithStandardRoute with data set #0
- testSetRouteOptionsWithStandardRoute with data set #1
- testSetRouteOptionsWithStandardRouteWithArgument with data set #0
- testSetRouteOptionsWithStandardRouteWithArgument with data set #1
- testSetRouteOptionsWithContentController with data set #0
- testSetRouteOptionsWithContentController with data set #1
- testSetRouteOptionsWithEntityTypeNoUpcasting with data set #0
- testSetRouteOptionsWithEntityTypeNoUpcasting with data set #1
- testSetRouteOptionsWithEntityTypeUpcasting with data set #0
- testSetRouteOptionsWithEntityTypeUpcasting with data set #1
- testSetRouteOptionsWithEntityFormUpcasting
- testSetRouteOptionsWithEntityUpcastingNoCreate
- testSetRouteOptionsWithEntityFormNoUpcasting
- testSetRouteOptionsWithEntityViewRouteAndManualParameters
- testSetRouteOptionsWithEntityViewRoute
- testSetRouteOptionsWithEntityListRoute
- testSetRouteOptionsWithEntityFormRoute
- testSetRouteOptionsWithEntityFormRouteAndArgument
6Entity.Drupal\Tests\Core\Entity\EntityTypeBundleInfoTest
- testClearCachedBundles
- testGetBundleInfo with data set #0
- testGetBundleInfo with data set #1
- testGetBundleInfo with data set #2
- testGetAllBundleInfo
- testGetAllBundleInfoWithEntityBundleInfo
17Entity.Drupal\Tests\Core\Entity\EntityTypeManagerTest
- testHasHandler with data set #0
- testHasHandler with data set #1
- testHasHandler with data set #2
- testGetStorage
- testGetListBuilder
- testGetViewBuilder
- testGetAccessControlHandler
- testGetFormObject
- testGetFormObjectInvalidOperation
- testGetHandler
- testGetHandlerMissingHandler
- testGetRouteProviders
- testProcessDefinition
- testGetDefinition with data set #0
- testGetDefinition with data set #1
- testGetDefinition with data set #2
- testGetDefinitionInvalidException
4Entity.Drupal\Tests\Core\Entity\EntityTypeRepositoryTest
- testGetEntityTypeLabels
- testGetEntityTypeFromClass
- testGetEntityTypeFromClassNoMatch
- testGetEntityTypeFromClassAmbiguous
44Entity.Drupal\Tests\Core\Entity\EntityTypeTest
- testGet with data set #0
- testGet with data set #1
- testGet with data set #2
- testGet with data set #3
- testGet with data set #4
- testGet with data set #5
- testSet with data set #0
- testSet with data set #1
- testSet with data set #2
- testSet with data set #3
- testSet with data set #4
- testSet with data set #5
- testGetKeys with data set #0
- testGetKeys with data set #1
- testGetKeys with data set #2
- testGetKey with data set #0
- testGetKey with data set #1
- testGetKey with data set #2
- testHasKey with data set #0
- testHasKey with data set #1
- testHasKey with data set #2
- testIsRevisionable
- testGetHandler
- testGetStorageClass
- testSetStorageClass
- testGetListBuilderClass
- testGetAccessControlClass
- testGetFormClass
- testHasFormClasses
- testGetViewBuilderClass
- testIdExceedsMaxLength
- testgetOriginalClassUnchanged
- testgetOriginalClassChanged
- testId
- testGetLabel
- testGetGroupLabel
- testGetSingularLabel
- testGetSingularLabelDefault
- testGetPluralLabel
- testGetPluralLabelDefault
- testGetCountLabel
- testGetCountLabelDefault
- testSetLinkTemplateWithInvalidPath
- testConstraintMethods
25Entity.Drupal\Tests\Core\Entity\EntityUnitTest
- testId
- testUuid
- testIsNew
- testGetEntityType
- testBundle
- testLabel
- testAccess
- testLanguage
- testLoad
- testLoadMultiple
- testCreate
- testSave
- testDelete
- testGetEntityTypeId
- testPreSave
- testPostSave
- testPreCreate
- testPostCreate
- testPreDelete
- testPostDelete
- testPostLoad
- testReferencedEntities
- testCacheTags
- testCacheContexts
- testCacheMaxAge
33Entity.Drupal\Tests\Core\Entity\EntityUrlTest
- testToUrlNoId
- testToUrlLinkTemplates with data set "canonical"
- testToUrlLinkTemplates with data set "version-history"
- testToUrlLinkTemplates with data set "edit-form"
- testToUrlLinkTemplates with data set "delete-form"
- testToUrlLinkTemplates with data set "revision"
- testToUrlLinkTemplateRevision with data set "default_revision"
- testToUrlLinkTemplateRevision with data set "non_default_revision"
- testToUrlLinkTemplateNoId with data set "collection"
- testToUrlLinkTemplateNoId with data set "add-page"
- testToUrlLinkTemplateAddForm with data set "no_bundle_key"
- testToUrlLinkTemplateAddForm with data set "bundle_entity_type"
- testToUrlLinkTemplateAddForm with data set "bundle_key"
- testToUrlUriCallbackUndefined with data set "no_callback"
- testToUrlUriCallbackUndefined with data set "uri_callback"
- testToUrlUriCallbackUndefined with data set "bundle_uri_callback"
- testToUrlUriCallback with data set "uri_callback"
- testToUrlUriCallback with data set "bundle_uri_callback"
- testUrlInfo with data set "default"
- testUrlInfo with data set "with_option"
- testUrlInfo with data set "revision"
- testUrlEmpty with data set "default"
- testUrlEmpty with data set "revision"
- testUrlEmpty with data set "option"
- testUrlEmpty with data set "default_option"
- testUrlEmpty with data set "option_merge"
- testUrlEmpty with data set "option_override"
- testUrl with data set "default"
- testUrl with data set "revision"
- testUrl with data set "option"
- testUrl with data set "default_option"
- testUrl with data set "option_merge"
- testUrl with data set "option_override"
18Entity.Drupal\Tests\Core\Entity\KeyValueStore\KeyValueEntityStorageTest
- testCreateWithPredefinedUuid
- testCreateWithoutUuidKey
- testCreate
- testSaveInsert
- testSaveUpdate
- testSaveConfigEntity
- testSaveRenameConfigEntity
- testSaveContentEntity
- testSaveInvalid
- testSaveDuplicate
- testLoad
- testLoadMissingEntity
- testLoadMultipleAll
- testLoadMultipleIds
- testLoadRevision
- testDeleteRevision
- testDelete
- testDeleteNothing
2Entity.Drupal\Tests\Core\Entity\Query\Sql\QueryTest
- testNoBaseTable
- testNoRevisionTable
19Entity.Drupal\Tests\Core\Entity\Routing\DefaultHtmlRouteProviderTest
- testGetAddPageRoute with data set "no_add_page_link_template"
- testGetAddPageRoute with data set "no_bundle"
- testGetAddPageRoute with data set "add_page"
- testGetAddFormRoute with data set "no_add_form_link_template"
- testGetAddFormRoute with data set "no_add_form_no_bundle"
- testGetAddFormRoute with data set "add_form_no_bundle"
- testGetAddFormRoute with data set "add_form_bundle_static"
- testGetAddFormRoute with data set "add_form_bundle_entity_id_key_type_null"
- testGetAddFormRoute with data set "add_form_bundle_entity_id_key_type_integer"
- testGetCanonicalRoute with data set "no_canonical_link_template"
- testGetCanonicalRoute with data set "no_view_builder"
- testGetCanonicalRoute with data set "id_key_type_null"
- testGetCanonicalRoute with data set "id_key_type_integer"
- testGetCollectionRoute with data set "no_collection_link_template"
- testGetCollectionRoute with data set "no_list_builder"
- testGetCollectionRoute with data set "no_admin_permission"
- testGetCollectionRoute with data set "collection_route"
- testGetEntityTypeIdKeyType
- testGetEntityTypeIdKeyTypeNotFieldable
33Entity.Drupal\Tests\Core\Entity\Sql\DefaultTableMappingTest
- testGetTableNames
- testGetAllColumns
- testGetFieldNames
- testGetColumnNames
- testGetExtraColumns
- testGetFieldColumnName with data set #0
- testGetFieldColumnName with data set #1
- testGetFieldColumnName with data set #2
- testGetFieldColumnName with data set #3
- testGetFieldColumnName with data set #4
- testGetFieldColumnName with data set #5
- testGetFieldColumnName with data set #6
- testGetFieldColumnNameInvalid with data set #0
- testGetFieldColumnNameInvalid with data set #1
- testGetFieldColumnNameInvalid with data set #2
- testGetFieldColumnNameInvalid with data set #3
- testGetFieldColumnNameInvalid with data set #4
- testGetFieldColumnNameInvalid with data set #5
- testGetFieldColumnNameInvalid with data set #6
- testGetFieldTableName with data set #0
- testGetFieldTableName with data set #1
- testGetFieldTableName with data set #2
- testGetFieldTableName with data set #3
- testGetFieldTableName with data set #4
- testGetFieldTableName with data set #5
- testGetFieldTableName with data set #6
- testGetFieldTableName with data set #7
- testGetFieldTableName with data set #8
- testGetFieldTableName with data set #9
- testGetFieldTableName with data set #10
- testGetFieldTableName with data set #11
- testGetFieldTableName with data set #12
- testGetFieldTableNameInvalid
19Entity.Drupal\Tests\Core\Entity\Sql\SqlContentEntityStorageSchemaTest
- testGetSchemaBase
- testGetSchemaRevisionable
- testGetSchemaTranslatable
- testGetSchemaRevisionableTranslatable
- testDedicatedTableSchema
- testDedicatedTableSchemaForEntityWithStringIdentifier
- testRequiresEntityDataMigration with data set #0
- testRequiresEntityDataMigration with data set #1
- testRequiresEntityDataMigration with data set #2
- testRequiresEntityDataMigration with data set #3
- testRequiresEntityDataMigration with data set #4
- testRequiresEntityDataMigration with data set #5
- testRequiresEntityDataMigration with data set #6
- testRequiresEntityStorageSchemaChanges with data set #0
- testRequiresEntityStorageSchemaChanges with data set #1
- testRequiresEntityStorageSchemaChanges with data set #2
- testRequiresEntityStorageSchemaChanges with data set #3
- testRequiresEntityStorageSchemaChanges with data set #4
- testonEntityTypeUpdateWithNewIndex
48Entity.Drupal\Tests\Core\Entity\Sql\SqlContentEntityStorageTest
- testGetBaseTable with data set #0
- testGetBaseTable with data set #1
- testGetRevisionTable with data set #0
- testGetRevisionTable with data set #1
- testGetDataTable
- testGetRevisionDataTable with data set #0
- testGetRevisionDataTable with data set #1
- testOnEntityTypeCreate
- testGetTableMappingEmpty
- testGetTableMappingSimple with data set #0
- testGetTableMappingSimple with data set #1
- testGetTableMappingSimple with data set #2
- testGetTableMappingSimple with data set #3
- testGetTableMappingSimpleWithFields with data set #0
- testGetTableMappingSimpleWithFields with data set #1
- testGetTableMappingSimpleWithFields with data set #2
- testGetTableMappingSimpleWithFields with data set #3
- testGetTableMappingSimpleWithDedicatedStorageFields
- testGetTableMappingRevisionable with data set #0
- testGetTableMappingRevisionable with data set #1
- testGetTableMappingRevisionable with data set #2
- testGetTableMappingRevisionable with data set #3
- testGetTableMappingRevisionableWithFields with data set #0
- testGetTableMappingRevisionableWithFields with data set #1
- testGetTableMappingRevisionableWithFields with data set #2
- testGetTableMappingRevisionableWithFields with data set #3
- testGetTableMappingTranslatable with data set #0
- testGetTableMappingTranslatable with data set #1
- testGetTableMappingTranslatable with data set #2
- testGetTableMappingTranslatable with data set #3
- testGetTableMappingTranslatableWithFields with data set #0
- testGetTableMappingTranslatableWithFields with data set #1
- testGetTableMappingTranslatableWithFields with data set #2
- testGetTableMappingTranslatableWithFields with data set #3
- testGetTableMappingRevisionableTranslatable with data set #0
- testGetTableMappingRevisionableTranslatable with data set #1
- testGetTableMappingRevisionableTranslatable with data set #2
- testGetTableMappingRevisionableTranslatable with data set #3
- testGetTableMappingRevisionableTranslatableWithFields with data set #0
- testGetTableMappingRevisionableTranslatableWithFields with data set #1
- testGetTableMappingRevisionableTranslatableWithFields with data set #2
- testGetTableMappingRevisionableTranslatableWithFields with data set #3
- testCreate
- testLoadMultiplePersistentCached
- testLoadMultipleNoPersistentCache
- testLoadMultiplePersistentCacheMiss
- testHasData
- testCleanIds
22Entity.Drupal\Tests\Core\Entity\TypedData\EntityAdapterUnitTest
- testGetConstraints
- testGetName
- testGetRoot
- testGetPropertyPath
- testGetParent
- testSetContext
- testGetValue
- testSetValue
- testGet
- testGetInvalidField
- testGetWithoutData
- testSet
- testSetWithoutData
- testGetProperties
- testToArray
- testToArrayWithoutData
- testIsEmpty
- testOnChange
- testGetDataDefinition
- testGetString
- testApplyDefaultValue
- testGetIterator
1Entity.Drupal\Tests\field\Kernel\Entity\Update\SqlContentEntityStorageSchemaColumnTest
- testColumnUpdate
1Entity.Drupal\Tests\node\Kernel\NodeOwnerTest
- testOwner
12Entity.Drupal\Tests\views\Unit\Plugin\area\EntityTest
- testRenderWithId
- testRenderWithIdAndToken with data set #0
- testRenderWithIdAndToken with data set #1
- testRenderWithIdAndToken with data set #2
- testRenderWithIdAndToken with data set #3
- testRenderWithUuid
- testCalculateDependenciesWithPlaceholder with data set #0
- testCalculateDependenciesWithPlaceholder with data set #1
- testCalculateDependenciesWithPlaceholder with data set #2
- testCalculateDependenciesWithPlaceholder with data set #3
- testCalculateDependenciesWithUuid
- testCalculateDependenciesWithEntityId
3Entity.Drupal\system\Tests\Entity\EntityAddUITest
- impletest_script_run_one_test
- testAddPageWithBundleEntities
- testAddPageWithoutBundleEntities
4Entity.Drupal\Tests\Core\Entity\EntityConstraintViolationListTest
- testFilterByFields
- testFilterByFieldsWithCompositeConstraints
- testFilterByFieldAccess
- testFilterByFieldAccessWithCompositeConstraint
3Entity.Drupal\Tests\Core\ParamConverter\EntityRevisionParamConverterTest
- testNonApplyingRoute
- testApplyingRoute
- testConvert
2124Field.Field
23Field.Drupal\field\Tests\Views\HandlerFieldFieldTest
_testSimpleFieldRender
fail: [Other] Line 144 of core/modules/field/src/Tests/Views/HandlerFieldFieldTest.php:
Value '




of2SMRc7


' is equal to value 'of2SMRc7'.

fail: [Other] Line 144 of core/modules/field/src/Tests/Views/HandlerFieldFieldTest.php:
Value '




xzmRi7nj


' is equal to value 'xzmRi7nj'.

fail: [Other] Line 144 of core/modules/field/src/Tests/Views/HandlerFieldFieldTest.php:
Value '




eg6xcs9L


' is equal to value 'eg6xcs9L'.

fail: [Other] Line 144 of core/modules/field/src/Tests/Views/HandlerFieldFieldTest.php:
Value '




h1fbPXGf


' is equal to value 'h1fbPXGf'.

fail: [Other] Line 144 of core/modules/field/src/Tests/Views/HandlerFieldFieldTest.php:
Value '




ylUcCNIa


' is equal to value 'ylUcCNIa'.

fail: [Other] Line 144 of core/modules/field/src/Tests/Views/HandlerFieldFieldTest.php:
Value '




jC3DYdqt


' is equal to value 'jC3DYdqt'.
_testFormatterSimpleFieldRender
fail: [Other] Line 183 of core/modules/field/src/Tests/Views/HandlerFieldFieldTest.php:
Value 248 is equal to value 3.

fail: [Other] Line 183 of core/modules/field/src/Tests/Views/HandlerFieldFieldTest.php:
Value 248 is equal to value 3.
_testMultipleFieldRender
fail: [Other] Line 205 of core/modules/field/src/Tests/Views/HandlerFieldFieldTest.php:
The amount of items is limited.
Value '




cIgk0U6r, icxwlq57, yYkWJkP0


' is equal to value 'cIgk0U6r, icxwlq57, yYkWJkP0'.

fail: [Other] Line 205 of core/modules/field/src/Tests/Views/HandlerFieldFieldTest.php:
The amount of items is limited.
Value '




wKbvP7XB, kHdGbRMl, e8uh839l


' is equal to value 'wKbvP7XB, kHdGbRMl, e8uh839l'.

fail: [Other] Line 205 of core/modules/field/src/Tests/Views/HandlerFieldFieldTest.php:
The amount of items is limited.
Value '




dSBngOQn, l3Fedryx, ko6GFvQe


' is equal to value 'dSBngOQn, l3Fedryx, ko6GFvQe'.

fail: [Other] Line 227 of core/modules/field/src/Tests/Views/HandlerFieldFieldTest.php:
The amount of items is limited and the offset is correct.
Value '




icxwlq57, yYkWJkP0, eUTuZVNL


' is equal to value 'icxwlq57, yYkWJkP0, eUTuZVNL'.

fail: [Other] Line 227 of core/modules/field/src/Tests/Views/HandlerFieldFieldTest.php:
The amount of items is limited and the offset is correct.
Value '




kHdGbRMl, e8uh839l, rJarBLBt


' is equal to value 'kHdGbRMl, e8uh839l, rJarBLBt'.

fail: [Other] Line 227 of core/modules/field/src/Tests/Views/HandlerFieldFieldTest.php:
The amount of items is limited and the offset is correct.
Value '




l3Fedryx, ko6GFvQe, jKLuK9f2


' is equal to value 'l3Fedryx, ko6GFvQe, jKLuK9f2'.

fail: [Other] Line 248 of core/modules/field/src/Tests/Views/HandlerFieldFieldTest.php:
The amount of items is limited and they are reversed.
Value '




yXjeh222, eUTuZVNL, yYkWJkP0


' is equal to value 'yXjeh222, eUTuZVNL, yYkWJkP0'.

fail: [Other] Line 248 of core/modules/field/src/Tests/Views/HandlerFieldFieldTest.php:
The amount of items is limited and they are reversed.
Value '




pYZBsfs5, rJarBLBt, e8uh839l


' is equal to value 'pYZBsfs5, rJarBLBt, e8uh839l'.

fail: [Other] Line 248 of core/modules/field/src/Tests/Views/HandlerFieldFieldTest.php:
The amount of items is limited and they are reversed.
Value '




fWetdQuo, jKLuK9f2, ko6GFvQe


' is equal to value 'fWetdQuo, jKLuK9f2, ko6GFvQe'.

fail: [Other] Line 266 of core/modules/field/src/Tests/Views/HandlerFieldFieldTest.php:
Items are limited to first and last.
Value '




cIgk0U6r, yXjeh222


' is equal to value 'cIgk0U6r, yXjeh222'.

fail: [Other] Line 266 of core/modules/field/src/Tests/Views/HandlerFieldFieldTest.php:
Items are limited to first and last.
Value '




wKbvP7XB, pYZBsfs5


' is equal to value 'wKbvP7XB, pYZBsfs5'.

fail: [Other] Line 266 of core/modules/field/src/Tests/Views/HandlerFieldFieldTest.php:
Items are limited to first and last.
Value '




dSBngOQn, fWetdQuo


' is equal to value 'dSBngOQn, fWetdQuo'.

fail: [Other] Line 286 of core/modules/field/src/Tests/Views/HandlerFieldFieldTest.php:
The amount of items is limited and the custom separator is correct.
Value '




cIgk0U6r:icxwlq57:yYkWJkP0


' is equal to value 'cIgk0U6r:icxwlq57:yYkWJkP0'.

fail: [Other] Line 286 of core/modules/field/src/Tests/Views/HandlerFieldFieldTest.php:
The amount of items is limited and the custom separator is correct.
Value '




wKbvP7XB:kHdGbRMl:e8uh839l


' is equal to value 'wKbvP7XB:kHdGbRMl:e8uh839l'.

fail: [Other] Line 286 of core/modules/field/src/Tests/Views/HandlerFieldFieldTest.php:
The amount of items is limited and the custom separator is correct.
Value '




dSBngOQn:l3Fedryx:ko6GFvQe


' is equal to value 'dSBngOQn:l3Fedryx:ko6GFvQe'.

fail: [Other] Line 305 of core/modules/field/src/Tests/Views/HandlerFieldFieldTest.php:
The custom separator is correctly escaped.
Value '




cIgk0U6rtesticxwlq57testyYkWJkP0


' is equal to value 'cIgk0U6rtesticxwlq57testyYkWJkP0'.

fail: [Other] Line 305 of core/modules/field/src/Tests/Views/HandlerFieldFieldTest.php:
The custom separator is correctly escaped.
Value '




wKbvP7XBtestkHdGbRMlteste8uh839l


' is equal to value 'wKbvP7XBtestkHdGbRMlteste8uh839l'.

fail: [Other] Line 305 of core/modules/field/src/Tests/Views/HandlerFieldFieldTest.php:
The custom separator is correctly escaped.
Value '




dSBngOQntestl3Fedryxtestko6GFvQe


' is equal to value 'dSBngOQntestl3Fedryxtestko6GFvQe'.
- setUp
- _testInaccessibleFieldRender
11Field.Drupal\views\Tests\Plugin\NumericFormatPluralTest
testNumericFormatPlural
fail: [Other] Line 52 of core/modules/views/src/Tests/Plugin/NumericFormatPluralTest.php:
Raw "0" found

fail: [Other] Line 76 of core/modules/views/src/Tests/Plugin/NumericFormatPluralTest.php:
Raw "0 times" found

fail: [Other] Line 76 of core/modules/views/src/Tests/Plugin/NumericFormatPluralTest.php:
Raw "1 time" found

fail: [Other] Line 76 of core/modules/views/src/Tests/Plugin/NumericFormatPluralTest.php:
Raw "2 times" found

fail: [Other] Line 76 of core/modules/views/src/Tests/Plugin/NumericFormatPluralTest.php:
Raw "3 times" found

fail: [Other] Line 76 of core/modules/views/src/Tests/Plugin/NumericFormatPluralTest.php:
Raw "4 times" found

fail: [Other] Line 76 of core/modules/views/src/Tests/Plugin/NumericFormatPluralTest.php:
Raw "42 times" found

fail: [Other] Line 114 of core/modules/views/src/Tests/Plugin/NumericFormatPluralTest.php:
Raw "0 time3" found

fail: [Other] Line 115 of core/modules/views/src/Tests/Plugin/NumericFormatPluralTest.php:
Raw "1 time0" found

fail: [Other] Line 116 of core/modules/views/src/Tests/Plugin/NumericFormatPluralTest.php:
Raw "2 time1" found

fail: [Other] Line 117 of core/modules/views/src/Tests/Plugin/NumericFormatPluralTest.php:
Raw "3 time2" found

fail: [Other] Line 118 of core/modules/views/src/Tests/Plugin/NumericFormatPluralTest.php:
Raw "4 time2" found

fail: [Other] Line 119 of core/modules/views/src/Tests/Plugin/NumericFormatPluralTest.php:
Raw "42 time3" found

fail: [Other] Line 127 of core/modules/views/src/Tests/Plugin/NumericFormatPluralTest.php:
Raw "0 times" found

fail: [Other] Line 128 of core/modules/views/src/Tests/Plugin/NumericFormatPluralTest.php:
Raw "1 time" found

fail: [Other] Line 129 of core/modules/views/src/Tests/Plugin/NumericFormatPluralTest.php:
Raw "2 times" found

fail: [Other] Line 130 of core/modules/views/src/Tests/Plugin/NumericFormatPluralTest.php:
Raw "3 times" found

fail: [Other] Line 131 of core/modules/views/src/Tests/Plugin/NumericFormatPluralTest.php:
Raw "4 times" found

fail: [Other] Line 132 of core/modules/views/src/Tests/Plugin/NumericFormatPluralTest.php:
Raw "42 times" found
- setUp
1Field.Drupal\KernelTests\Core\Field\FieldItemTest
- testSaveWorkflow
1Field.Drupal\KernelTests\Core\Field\FieldModuleUninstallValidatorTest
- testUninstallingModule
3Field.Drupal\KernelTests\Core\Field\FieldSettingsTest
- testBaseFieldSettings
- testConfigurableFieldStorageSettings
- testConfigurableFieldSettings
5Field.Drupal\Tests\Core\Field\FieldDefinitionListenerTest
- testOnFieldDefinitionCreateNewField
- testOnFieldDefinitionCreateExistingField
- testOnFieldDefinitionUpdate
- testOnFieldDefinitionDeleteMultipleBundles
- testOnFieldDefinitionDeleteSingleBundles
6Field.Drupal\Tests\Core\Field\FieldFilteredMarkupTest
- testCreate with data set #0
- testCreate with data set #1
- testCreate with data set #2
- testCreate with data set #3
- testCreate with data set #4
- testdisplayAllowedTags
10Field.Drupal\Tests\Core\Field\FieldItemListTest
- testEquals with data set #0
- testEquals with data set #1
- testEquals with data set #2
- testEquals with data set #3
- testEquals with data set #4
- testEquals with data set #5
- testEqualsEmptyItems
- testDefaultValuesForm
- testDefaultValuesFormValidate
- testDefaultValuesFormSubmit
1Field.Drupal\Tests\Core\Field\PluginSettingsBaseTest
- testGetThirdPartySettings
3Field.Drupal\field\Tests\Boolean\BooleanFieldTest
- setUp
- testBooleanField
- testFormAccess
2Field.Drupal\field\Tests\Boolean\BooleanFormatterSettingsTest
- setUp
- testBooleanFormatterSettings
2Field.Drupal\field\Tests\Email\EmailFieldTest
- setUp
- testEmailField
2Field.Drupal\field\Tests\FieldAccessTest
- setUp
- testFieldAccess
2Field.Drupal\field\Tests\FieldDefaultValueCallbackTest
- setUp
- testDefaultValueCallbackForm
2Field.Drupal\field\Tests\FieldHelpTest
- setUp
- testFieldHelp
2Field.Drupal\field\Tests\FieldImportDeleteUninstallUiTest
- setUp
- testImportDeleteUninstall
12Field.Drupal\field\Tests\FormTest
- setUp
- testFieldFormSingle
- testFieldFormDefaultValue
- testFieldFormSingleRequired
- testFieldFormUnlimited
- testFieldFormUnlimitedRequired
- testFieldFormMultivalueWithRequiredRadio
- testFieldFormJSAddMore
- testFieldFormMultipleWidget
- testFieldFormAccess
- testHiddenField
- testLabelOnMultiValueFields
2Field.Drupal\field\Tests\NestedFormTest
- setUp
- testNestedFieldForm
7Field.Drupal\field\Tests\Number\NumberFieldTest
- setUp
- testNumberDecimalField
- testNumberIntegerField
- testNumberFloatField
- testNumberFormatter
- testCreateNumberFloatField
- testCreateNumberDecimalField
2Field.Drupal\field\Tests\reEnableModuleFieldTest
- setUp
- testReEnabledField
3Field.Drupal\field\Tests\TranslationWebTest
- setUp
- testFieldFormTranslationRevisions
- checkTranslationRevisions
2Field.Drupal\field\Tests\Update\EmailWidgetSizeSettingUpdateTest
- testFieldPostUpdateEmailWidgetSizeSetting
- runUpdates
2Field.Drupal\field\Tests\Update\EntityReferenceHandlerSettingUpdateTest
- testFieldPostUpdateERHandlerSetting
- runUpdates
4Field.Drupal\field\Tests\Update\FieldUpdateTest
- testFieldUpdate8001
- runUpdates
- testFieldUpdate8002
- testFieldUpdate8003
4Field.Drupal\field\Tests\Views\FieldUITest
- setUp
- testHandlerUI
- testHandlerUIAggregation
- testBooleanFilterHandler
1Field.Drupal\Tests\aggregator\Kernel\AggregatorTitleTest
- testStringFormatter
1Field.Drupal\Tests\field\Kernel\Boolean\BooleanFormatterTest
- testBooleanFormatter
1Field.Drupal\Tests\field\Kernel\Boolean\BooleanItemTest
- testBooleanItem
4Field.Drupal\Tests\field\Kernel\BulkDeleteTest
- testDeleteField
- testPurgeWithDeletedAndActiveField
- testPurgeField
- testPurgeFieldStorage
2Field.Drupal\Tests\field\Kernel\ConfigFieldDefinitionTest
- testBundleFieldDefinition
- testFieldStorageDefinition
3Field.Drupal\Tests\field\Kernel\DisplayApiTest
- testFieldItemListView
- testFieldItemView
- testFieldEmpty
1Field.Drupal\Tests\field\Kernel\Email\EmailItemTest
- testEmailItem
2Field.Drupal\Tests\field\Kernel\EntityReference\EntityReferenceSettingsTest
- testConfigTargetBundleDeletion
- testCustomTargetBundleDeletion
5Field.Drupal\Tests\field\Kernel\FieldAttachOtherTest
- testEntityDisplayBuild
- testEntityDisplayViewMultiple
- testEntityCache
- testEntityFormDisplayBuildForm
- testEntityFormDisplayExtractFormValues
7Field.Drupal\Tests\field\Kernel\FieldAttachStorageTest
- testFieldAttachSaveLoad
- testFieldAttachLoadMultiple
- testFieldAttachSaveEmptyData
- testFieldAttachSaveEmptyDataDefaultValue
- testFieldAttachDelete
- testEntityCreateBundle
- testEntityDeleteBundle
6Field.Drupal\Tests\field\Kernel\FieldCrudTest
- testCreateField
- testCreateFieldCustomStorage
- testReadField
- testUpdateField
- testDeleteField
- testDeleteFieldCrossDeletion
2Field.Drupal\Tests\field\Kernel\FieldDataCountTest
- testEntityCountAndHasData
- testCountWithIndex0
1Field.Drupal\Tests\field\Kernel\FieldDefinitionIntegrityTest
- testFieldPluginDefinitionIntegrity
1Field.Drupal\Tests\field\Kernel\FieldImportChangeTest
- testImportChange
2Field.Drupal\Tests\field\Kernel\FieldImportCreateTest
- testImportCreateDefault
- testImportCreate
1Field.Drupal\Tests\field\Kernel\FieldImportDeleteTest
- testImportDelete
2Field.Drupal\Tests\field\Kernel\FieldImportDeleteUninstallTest
- testImportDeleteUninstall
- testImportAlreadyDeletedUninstall
8Field.Drupal\Tests\field\Kernel\FieldStorageCrudTest
- testCreate
- testCreateWithExplicitSchema
- testRead
- testIndexes
- testDelete
- testUpdateFieldType
- testUpdate
- testUpdateForbid
4Field.Drupal\Tests\field\Kernel\FieldTypePluginManagerTest
- testDefaultSettings
- testCreateInstance
- testCreateInstanceWithConfig
- testMainProperty
2Field.Drupal\Tests\field\Kernel\FieldValidationTest
- testCardinalityConstraint
- testFieldConstraints
1Field.Drupal\Tests\field\Kernel\FormatterPluginManagerTest
- testNotApplicableFallback
1Field.Drupal\Tests\field\Kernel\Migrate\d7\MigrateFieldFormatterSettingsTest
- testMigration
1Field.Drupal\Tests\field\Kernel\Migrate\d7\MigrateFieldInstanceTest
- testFieldInstances
1Field.Drupal\Tests\field\Kernel\Migrate\d7\MigrateFieldInstanceWidgetSettingsTest
- testWidgetSettings
1Field.Drupal\Tests\field\Kernel\Migrate\d7\MigrateFieldTest
- testFields
1Field.Drupal\Tests\field\Kernel\Migrate\d7\MigrateViewModesTest
- testMigration
1Field.Drupal\Tests\field\Kernel\Migrate\d7\RollbackFieldInstanceTest
- testFieldInstances
1Field.Drupal\Tests\field\Kernel\Migrate\d7\RollbackFieldTest
- testFields
1Field.Drupal\Tests\field\Kernel\Migrate\d7\RollbackViewModesTest
- testMigration
1Field.Drupal\Tests\field\Kernel\Number\NumberItemTest
- testNumberItem
1Field.Drupal\Tests\field\Kernel\ShapeItemTest
- testShapeItem
1Field.Drupal\Tests\field\Kernel\String\RawStringFormatterTest
- testStringFormatter
1Field.Drupal\Tests\field\Kernel\String\StringFormatterTest
- testStringFormatter
1Field.Drupal\Tests\field\Kernel\String\UuidFormatterTest
- testUuidStringFormatter
1Field.Drupal\Tests\field\Kernel\TestItemTest
- testTestItem
1Field.Drupal\Tests\field\Kernel\TestItemWithDependenciesTest
- testTestItemWithDepenencies
2Field.Drupal\Tests\field\Kernel\Timestamp\TimestampFormatterTest
- testTimestampFormatter
- testTimestampAgoFormatter
2Field.Drupal\Tests\field\Kernel\TranslationTest
- testTranslatableFieldSaveLoad
- testFieldAccess
1Field.Drupal\Tests\field\Kernel\Uri\UriItemTest
- testUriField
2Field.Drupal\Tests\field\Kernel\WidgetPluginManagerTest
- testWidgetDefinitionAlter
- testNotApplicableFallback
5Field.Drupal\Tests\field\Unit\FieldConfigEntityUnitTest
- testCalculateDependencies
- testCalculateDependenciesIncorrectBundle
- testOnDependencyRemoval
- testToArray
- testGetType
1Field.Drupal\Tests\field\Unit\FieldStorageConfigEntityUnitTest
- testCalculateDependencies
3Field.Drupal\Tests\field\Unit\FieldUninstallValidatorTest
- testValidateNoStorages
- testValidateDeleted
- testValidateNoDeleted
4Field.Drupal\Tests\field\Unit\Plugin\migrate\process\d6\FieldSettingsTest
- testGetSettings with data set #0
- testGetSettings with data set #1
- testGetSettings with data set #2
- testGetSettings with data set #3
2Field.Drupal\Tests\field\Unit\Plugin\migrate\process\d6\FieldTypeDefaultsTest
- testDefaults
- testDefaultsException
1Field.Drupal\Tests\field\Unit\Plugin\migrate\process\d7\FieldInstanceSettingsTest
- testTransformImageSettings
1Field.Drupal\Tests\field\Unit\Plugin\migrate\process\d7\FieldSettingsTest
- testTransformImageSettings
3Field.Drupal\Tests\field\Unit\Plugin\migrate\source\d6\FieldInstancePerFormDisplayTest
- testRetrieval
- testSourceCount
- testSourceId
3Field.Drupal\Tests\field\Unit\Plugin\migrate\source\d6\FieldInstancePerViewModeTest
- testRetrieval
- testSourceCount
- testSourceId
3Field.Drupal\Tests\field\Unit\Plugin\migrate\source\d6\FieldInstanceTest
- testRetrieval
- testSourceCount
- testSourceId
3Field.Drupal\Tests\field\Unit\Plugin\migrate\source\d6\FieldTest
- testRetrieval
- testSourceCount
- testSourceId
3Field.Drupal\Tests\field\Unit\Plugin\migrate\source\d7\FieldInstancePerFormDisplayTest
- testRetrieval
- testSourceCount
- testSourceId
3Field.Drupal\Tests\field\Unit\Plugin\migrate\source\d7\FieldInstancePerViewModeTest
- testRetrieval
- testSourceCount
- testSourceId
3Field.Drupal\Tests\field\Unit\Plugin\migrate\source\d7\FieldInstanceTest
- testRetrieval
- testSourceCount
- testSourceId
3Field.Drupal\Tests\field\Unit\Plugin\migrate\source\d7\FieldTest
- testRetrieval
- testSourceCount
- testSourceId
3Field.Drupal\Tests\field\Unit\Plugin\migrate\source\d7\ViewModeTest
- testRetrieval
- testSourceCount
- testSourceId
5Field.Drupal\Tests\file\Kernel\Formatter\FileEntityFormatterTest
- testFormatterFileLink
- testFormatterFileUri
- testFormatterFileExtension
- testFormatterFileMime
- testFormatterFileSize
1Field.Drupal\Tests\user\Kernel\Field\UserNameFormatterTest
- testFormatter
2474File.File
23File.Drupal\file\Tests\FileFieldRSSContentTest
testFileFieldRSSContent
fail: [Other] Line 65 of core/modules/file/src/Tests/FileFieldRSSContentTest.php:
File field RSS enclosure is displayed when viewing the RSS feed.
transformRootRelativeUrlsToAbsolute
exception: [Warning] Line 47 of core/lib/Drupal/Core/EventSubscriber/RssResponseRelativeUrlFilter.php:
DOMDocument::loadXML(): XML declaration allowed only at the start of the document in Entity, line: 6
parse
exception: [Warning] Line 133 of core/modules/simpletest/src/AssertContentTrait.php:
simplexml_import_dom(): Invalid Nodetype to importsimplexml_import_dom(Object) (Line: 133)
Drupal\simpletest\WebTestBase->parse() (Line: 226)
Drupal\simpletest\WebTestBase->xpath('descendant-or-self::enclosure[@url = 'http://localhost/checkout/sites/simpletest/57399124/files/2016-10/text-0.txt' and (@length = '1024') and (@type = 'text/plain')]') (Line: 250)
Drupal\simpletest\WebTestBase->cssSelect('enclosure[url="http://localhost/checkout/sites/simpletest/57399124/files/2016-10/text-0.txt"][length="1024"][type="text/plain"]') (Line: 65)
Drupal\file\Tests\FileFieldRSSContentTest->testFileFieldRSSContent() (Line: 1060)
Drupal\simpletest\TestBase->run(Array) (Line: 752)
simpletest_script_run_one_test('776', 'Drupal\file\Tests\FileFieldRSSContentTest') (Line: 66)
- setUp
- uploadNodeFiles
21File.Drupal\file\Tests\FileListingTest
testFileListingPages
fail: [Other] Line 126 of core/modules/file/src/Tests/FileListingTest.php:
Unused file marked as temporary.
Value 1 is equal to value 0.
- setUp
- testFileListingUsageNoLink
7File.Drupal\file\Tests\DownloadTest
- setUp
- createUri
- createFile
- testPublicFileTransfer
- doPrivateFileTransferTest
- checkUrl
- testFileCreateUrl
6File.Drupal\file\Tests\FileFieldAnonymousSubmissionTest
- setUp
- testAnonymousNode
- testAnonymousNodeWithFile
- testAnonymousNodeWithFileWithoutTitle
- doTestNodeWithFileWithoutTitle
- testAuthenticatedNodeWithFileWithoutTitle
5File.Drupal\file\Tests\FileFieldDisplayTest
- setUp
- testNodeDisplay
- uploadNodeFiles
- testDefaultFileFieldDisplay
- testDescToggle
3File.Drupal\file\Tests\FileFieldFormatterAccessTest
- setUp
- uploadNodeFiles
- testFileAccessHandler
3File.Drupal\file\Tests\FileFieldPathTest
- setUp
- uploadNodeFiles
- testUploadPath
4File.Drupal\file\Tests\FileFieldRevisionTest
- setUp
- uploadNodeFiles
- testRevisions
- replaceNodeFile
7File.Drupal\file\Tests\FileFieldValidateTest
- setUp
- testRequired
- uploadNodeFiles
- testFileMaxSize
- testFileExtension
- testFileRemoval
- removeNodeFile
12File.Drupal\file\Tests\FileFieldWidgetTest
- setUp
- uploadNodeFiles
- testSingleValuedWidget
- testMultiValuedWidget
- testPrivateFileSetting
- testPrivateFileComment
- fieldUIAddNewField
- testWidgetValidation
- testWidgetElement
- testTemporaryFileRemovalExploit
- doTestTemporaryFileRemovalExploit
- testTemporaryFileRemovalExploitAnonymous
2File.Drupal\file\Tests\FileManagedAccessTest
- setUp
- testFileAccess
4File.Drupal\file\Tests\FileManagedFileElementTest
- setUp
- testManagedFile
- testManagedFileRemoved
- testFileRemovedFromDisk
2File.Drupal\file\Tests\FileOnTranslatedEntityTest
- setUp
- testSyncedFiles
3File.Drupal\file\Tests\FilePrivateTest
- setUp
- uploadNodeFiles
- testPrivateFile
3File.Drupal\file\Tests\FileTokenReplaceTest
- setUp
- uploadNodeFiles
- testFileTokenReplacement
2File.Drupal\file\Tests\PrivateFileOnTranslatedEntityTest
- setUp
- testPrivateLanguageFile
10File.Drupal\file\Tests\RemoteFileSaveUploadTest
- setUp
- testNormal
- testHandleExtension
- testHandleDangerousFile
- testHandleFileMunge
- testExistingRename
- testExistingReplace
- testExistingError
- testNoUpload
- testDrupalMovingUploadedFileError
10File.Drupal\file\Tests\SaveUploadTest
- setUp
- testNormal
- testHandleExtension
- testHandleDangerousFile
- testHandleFileMunge
- testExistingRename
- testExistingReplace
- testExistingError
- testNoUpload
- testDrupalMovingUploadedFileError
2File.Drupal\file\Tests\Views\RelationshipUserFileDataTest
- setUp
- testViewsHandlerRelationshipUserFileData
3File.Drupal\Tests\file\Kernel\AccessTest
- testOnlyOwnerCanDeleteUpdateFile
- testStatusFieldIsNotEditable
- testCreateAccess
4File.Drupal\Tests\file\Kernel\CopyTest
- testNormal
- testExistingRename
- testExistingReplace
- testExistingError
2File.Drupal\Tests\file\Kernel\DeleteTest
- testUnused
- testInUse
1File.Drupal\Tests\file\Kernel\FileItemTest
- testFileItem
2File.Drupal\Tests\file\Kernel\FileItemValidationTest
- testFileValidationConstraint with data set #0
- testFileValidationConstraint with data set #1
6File.Drupal\Tests\file\Kernel\LoadTest
- testLoadMissingFid
- testLoadMissingFilepath
- testLoadInvalidStatus
- testSingleValues
- testMultiple
- testUuidValues
1File.Drupal\Tests\file\Kernel\Migrate\d7\MigrateFileTest
- testFileMigration
1File.Drupal\Tests\file\Kernel\Migrate\MigrateFileStubTest
- testStub
5File.Drupal\Tests\file\Kernel\MoveTest
- testNormal
- testExistingRename
- testExistingReplace
- testExistingReplaceSelf
- testExistingError
5File.Drupal\Tests\file\Kernel\SaveDataTest
- testWithoutFilename
- testWithFilename
- testExistingRename
- testExistingReplace
- testExistingError
1File.Drupal\Tests\file\Kernel\SaveTest
- testFileSave
1File.Drupal\Tests\file\Kernel\SpaceUsedTest
- testFileSpaceUsed
7File.Drupal\Tests\file\Kernel\UsageTest
- testGetUsage
- testAddUsage
- testRemoveUsage
- testTempFileCleanupDefault
- testTempFileNoCleanup
- testTempFileCustomCleanup
- testFileUsageWithEntityTranslation
1File.Drupal\Tests\file\Kernel\ValidateTest
- testCallerValidation
5File.Drupal\Tests\file\Kernel\ValidatorTest
- testFileValidateExtensions
- testFileValidateIsImage
- testFileValidateImageResolution
- testFileValidateNameLength
- testFileValidateSize
1File.Drupal\Tests\file\Kernel\Views\ExtensionViewsFieldTest
- testFileExtensionTarOption
1File.Drupal\Tests\file\Unit\Plugin\migrate\process\d6\CckFileTest
- testTransformAltTitle
5File.Drupal\Tests\file\Unit\Plugin\migrate\process\d6\FileUriTest
- testPublic
- testPublicUnknownBasePath
- testPrivate
- testPrivateUnknownBasePath
- testTemporary
3File.Drupal\Tests\file\Unit\Plugin\migrate\source\d6\FileTest
- testRetrieval
- testSourceCount
- testSourceId
3File.Drupal\Tests\file\Unit\Plugin\migrate\source\d6\UploadInstanceTest
- testRetrieval
- testSourceCount
- testSourceId
3File.Drupal\Tests\file\Unit\Plugin\migrate\source\d6\UploadTest
- testRetrieval
- testSourceCount
- testSourceId
7File.Drupal\Tests\file\Unit\Plugin\migrate\source\d7\FileTest
- testPublicUri
- testPrivateUri
- testTemporaryUri
- testFilteringByScheme
- testRetrieval
- testSourceCount
- testSourceId
6File.Drupal\Tests\migrate\Unit\process\UrlEncodeTest
- testUrls with data set "A URL with no characters requiring encoding"
- testUrls with data set "The definitive use case - encoding spaces in URLs"
- testUrls with data set "Definitive use case 2 - spaces in directories"
- testUrls with data set "Local filespecs without spaces should not be transformed"
- testUrls with data set "Local filespecs with spaces should not be transformed"
- testUrls with data set "Make sure URL characters (:, ?, &) are not encoded but others are."
1File.Drupal\Tests\options\Kernel\Views\FileViewsDataTest
- testRelationshipViewsData
5File.Drupal\KernelTests\Core\File\DirectoryTest
- testFileCheckLocalDirectoryHandling
- testFileCheckDirectoryHandling
- testFileCreateNewFilepath
- testFileDestination
- testFileDirectoryTemp
1File.Drupal\KernelTests\Core\File\HtaccessTest
- testHtaccessSave
1File.Drupal\KernelTests\Core\File\MimeTypeTest
- testFileMimeTypeDetection
5File.Drupal\KernelTests\Core\File\NameMungingTest
- testMunging
- testMungeNullByte
- testMungeIgnoreInsecure
- testMungeIgnoreWhitelisted
- testUnMunge
1File.Drupal\KernelTests\Core\File\ReadOnlyStreamWrapperTest
- testReadOnlyBehavior
5File.Drupal\KernelTests\Core\File\RemoteFileDirectoryTest
- testFileCheckLocalDirectoryHandling
- testFileCheckDirectoryHandling
- testFileCreateNewFilepath
- testFileDestination
- testFileDirectoryTemp
7File.Drupal\KernelTests\Core\File\RemoteFileScanDirectoryTest
- testReturn
- testOptionCallback
- testOptionNoMask
- testOptionKey
- testOptionRecurse
- testOptionMinDepth
- testIgnoreDirectories
3File.Drupal\KernelTests\Core\File\RemoteFileUnmanagedCopyTest
- testNormal
- testNonExistent
- testOverwriteSelf
4File.Drupal\KernelTests\Core\File\RemoteFileUnmanagedDeleteRecursiveTest
- testSingleFile
- testEmptyDirectory
- testDirectory
- testSubDirectory
3File.Drupal\KernelTests\Core\File\RemoteFileUnmanagedDeleteTest
- testNormal
- testMissing
- testDirectory
3File.Drupal\KernelTests\Core\File\RemoteFileUnmanagedMoveTest
- testNormal
- testMissing
- testOverwriteSelf
1File.Drupal\KernelTests\Core\File\RemoteFileUnmanagedSaveDataTest
- testFileSaveData
7File.Drupal\KernelTests\Core\File\ScanDirectoryTest
- testReturn
- testOptionCallback
- testOptionNoMask
- testOptionKey
- testOptionRecurse
- testOptionMinDepth
- testIgnoreDirectories
5File.Drupal\KernelTests\Core\File\StreamWrapperTest
- testGetClassName
- testGetInstanceByScheme
- testUriFunctions
- testFileFunctions
- testGetValidStreamScheme
3File.Drupal\KernelTests\Core\File\UnmanagedCopyTest
- testNormal
- testNonExistent
- testOverwriteSelf
4File.Drupal\KernelTests\Core\File\UnmanagedDeleteRecursiveTest
- testSingleFile
- testEmptyDirectory
- testDirectory
- testSubDirectory
3File.Drupal\KernelTests\Core\File\UnmanagedDeleteTest
- testNormal
- testMissing
- testDirectory
3File.Drupal\KernelTests\Core\File\UnmanagedMoveTest
- testNormal
- testMissing
- testOverwriteSelf
1File.Drupal\KernelTests\Core\File\UnmanagedSaveDataTest
- testFileSaveData
3File.Drupal\KernelTests\Core\File\UrlRewritingTest
- testShippedFileURL
- testPublicManagedFileURL
- testRelativeFileURL
2File.Drupal\system\Tests\File\ConfigTest
- setUp
- testFileConfigurationPage
2File.Drupal\system\Tests\File\FileSaveHtaccessLoggingTest
- impletest_script_run_one_test
- testHtaccessSave
10File.Drupal\Tests\Core\File\FileSystemTest
- testChmodFile
- testChmodDir
- testChmodUnsuccessful
- testUnlink
- testBasename with data set #0
- testBasename with data set #1
- testBasename with data set #2
- testUriScheme with data set #0
- testUriScheme with data set #1
- testUriScheme with data set #2
1File.Drupal\Tests\file\Kernel\Views\FileViewsFieldAccessTest
- testFileFields
43525Image.Image
91Image.Drupal\image\Tests\ImageAdminStylesTest
testEditEffect
fail: [Other] Line 402 of core/modules/image/src/Tests/ImageAdminStylesTest.php:
"Scale and crop 300×200" found

fail: [Other] Line 407 of core/modules/image/src/Tests/ImageAdminStylesTest.php:
"Scale and crop 360×240" found

fail: [Other] Line 425 of core/modules/image/src/Tests/ImageAdminStylesTest.php:
"Scale 24×19" found

fail: [Other] Line 426 of core/modules/image/src/Tests/ImageAdminStylesTest.php:
"Scale 12×19" found
- setUp
- testNumericStyleName
- testStyle
- testAjaxEnabledEffectForm
- uploadNodeImage
- testStyleReplacement
- testFlushUserInterface
- testConfigImport
- testImageStyleAccess
11Image.Drupal\image\Tests\ImageDimensionsTest
testImageDimensions
fail: [Other] Line 66 of core/modules/image/src/Tests/ImageDimensionsTest.php:
Value '' is equal to value ''.

fail: [Other] Line 87 of core/modules/image/src/Tests/ImageDimensionsTest.php:
Value '' is equal to value ''.

fail: [Other] Line 109 of core/modules/image/src/Tests/ImageDimensionsTest.php:
Value '' is equal to value ''.

fail: [Other] Line 131 of core/modules/image/src/Tests/ImageDimensionsTest.php:
Value '' is equal to value ''.

fail: [Other] Line 149 of core/modules/image/src/Tests/ImageDimensionsTest.php:
Value '' is equal to value ''.

fail: [Other] Line 170 of core/modules/image/src/Tests/ImageDimensionsTest.php:
Value '' is equal to value ''.

fail: [Other] Line 190 of core/modules/image/src/Tests/ImageDimensionsTest.php:
Value '' is equal to value ''.

fail: [Other] Line 211 of core/modules/image/src/Tests/ImageDimensionsTest.php:
Value '' is equal to value ''.

fail: [Other] Line 232 of core/modules/image/src/Tests/ImageDimensionsTest.php:
Value '' is equal to value ''.

fail: [Other] Line 253 of core/modules/image/src/Tests/ImageDimensionsTest.php:
Value '' is equal to value ''.

fail: [Other] Line 267 of core/modules/image/src/Tests/ImageDimensionsTest.php:
Value '' is equal to value ''.
- impletest_script_run_one_test
33Image.Drupal\image\Tests\ImageFieldDisplayTest
_testImageFieldFormatters
fail: [Other] Line 104 of core/modules/image/src/Tests/ImageFieldDisplayTest.php:
Default formatter displaying correctly on full node view.

fail: [Other] Line 104 of core/modules/image/src/Tests/ImageFieldDisplayTest.php:
Default formatter displaying correctly on full node view.
testImageFieldSettings
fail: [Other] Line 274 of core/modules/image/src/Tests/ImageFieldDisplayTest.php:
Image displayed using user supplied alt and title attributes.
testImageFieldDefaultImage
fail: [Other] Line 371 of core/modules/image/src/Tests/ImageFieldDisplayTest.php:
Default image displayed when no user supplied image is present.

fail: [Other] Line 397 of core/modules/image/src/Tests/ImageFieldDisplayTest.php:
User supplied image is displayed.

fail: [Other] Line 445 of core/modules/image/src/Tests/ImageFieldDisplayTest.php:
Default private image displayed when no user supplied image is present.
- setUp
- previewNodeImage
- uploadNodeImage
2Image.Drupal\image\Tests\FileMoveTest
- impletest_script_run_one_test
- testNormal
11Image.Drupal\image\Tests\ImageEffectsTest
- setUp
- getImage
- testResizeEffect
- testScaleEffect
- testCropEffect
- testConvertEffect
- testScaleAndCropEffect
- testDesaturateEffect
- testRotateEffect
- testImageEffectsCaching
- testEffectFormValidationErrors
3Image.Drupal\image\Tests\ImageFieldDefaultImagesTest
- setUp
- testDefaultImages
- testInvalidDefaultImage
4Image.Drupal\image\Tests\ImageFieldValidateTest
- setUp
- uploadNodeImage
- testResolution
- testRequiredAttributes
2Image.Drupal\image\Tests\ImageFieldWidgetTest
- setUp
- testWidgetElement
2Image.Drupal\image\Tests\ImageOnTranslatedEntityTest
- setUp
- testSyncedImages
2Image.Drupal\image\Tests\ImageStyleDeleteTest
- setUp
- testDelete
2Image.Drupal\image\Tests\ImageStyleFlushTest
- setUp
- testFlush
4Image.Drupal\image\Tests\ImageStylesPathAndUrlTest
- setUp
- testImageStylePath
- doImageStyleUrlAndPathTests
- testImageStyleUrlForMissingSourceImage
4Image.Drupal\image\Tests\ImageThemeFunctionTest
- setUp
- testImageFormatterTheme
- testImageStyleTheme
- testImageAltFunctionality
2Image.Drupal\image\Tests\Update\ImageUpdateTest
- testPostUpdateImageStylesDependencies
- runUpdates
2Image.Drupal\image\Tests\Views\RelationshipUserImageDataTest
- setUp
- testViewsHandlerRelationshipUserImageData
1Image.Drupal\Tests\image\Kernel\ImageFormatterTest
- testImageFormatterCacheTags
1Image.Drupal\Tests\image\Kernel\ImageImportTest
- testImport
1Image.Drupal\Tests\image\Kernel\ImageItemTest
- testImageItem
5Image.Drupal\Tests\image\Kernel\ImageStyleCustomStreamWrappersTest
- testCustomStreamWrappers with data set #0
- testCustomStreamWrappers with data set #1
- testCustomStreamWrappers with data set #2
- testCustomStreamWrappers with data set #3
- testCustomStreamWrappers with data set #4
1Image.Drupal\Tests\image\Kernel\ImageStyleIntegrationTest
- testEntityDisplayDependency
4Image.Drupal\Tests\image\Kernel\Migrate\d6\MigrateImageCacheTest
- testMissingTable
- testPassingMigration
- testMissingEffectPlugin
- testInvalidCropValues
1Image.Drupal\Tests\image\Kernel\Migrate\d7\MigrateImageSettingsTest
- testMigration
1Image.Drupal\Tests\image\Kernel\Migrate\d7\MigrateImageStylesTest
- testImageStylesMigration
1Image.Drupal\Tests\image\Kernel\Views\ImageViewsDataTest
- testRelationshipViewsData
7Image.Drupal\Tests\image\Unit\PageCache\DenyPrivateImageStyleDownloadTest
- testPrivateImageStyleDownloadPolicy with data set #0
- testPrivateImageStyleDownloadPolicy with data set #1
- testPrivateImageStyleDownloadPolicy with data set #2
- testPrivateImageStyleDownloadPolicy with data set #3
- testPrivateImageStyleDownloadPolicy with data set #4
- testPrivateImageStyleDownloadPolicy with data set #5
- testPrivateImageStyleDownloadPolicy with data set #6
3Image.Drupal\Tests\image\Unit\Plugin\migrate\source\d6\ImageCachePresetTest
- testRetrieval
- testSourceCount
- testSourceId
3Image.Drupal\Tests\image\Unit\Plugin\migrate\source\d7\MigrateImageStylesTest
- testRetrieval
- testSourceCount
- testSourceId
4Image.Drupal\KernelTests\Core\Image\ToolkitGdTest
- testManipulations
- testResourceDestruction
- testGifTransparentImages
- testMissingOperation
2Image.Drupal\system\Tests\Image\ToolkitSetupFormTest
- setUp
- testToolkitSetupForm
8Image.Drupal\system\Tests\Image\ToolkitTest
- setUp
- getImage
- testGetAvailableToolkits
- testLoad
- testSave
- testApply
- testApplyNoParameters
- testDerivative
5Image.Drupal\Tests\Component\Utility\ImageTest
- testScaleDimensions with data set #0
- testScaleDimensions with data set #1
- testScaleDimensions with data set #2
- testScaleDimensions with data set #3
- testScaleDimensions with data set #4
4223Image.Drupal\Tests\Component\Utility\RectangleTest
- testWrongWidth
- testWrongHeight
- testRotateDimensions with data set #0
- testRotateDimensions with data set #1
- testRotateDimensions with data set #2
- testRotateDimensions with data set #3
- testRotateDimensions with data set #4
- testRotateDimensions with data set #5
- testRotateDimensions with data set #6
- testRotateDimensions with data set #7
- testRotateDimensions with data set #8
- testRotateDimensions with data set #9
- testRotateDimensions with data set #10
- testRotateDimensions with data set #11
- testRotateDimensions with data set #12
- testRotateDimensions with data set #13
- testRotateDimensions with data set #14
- testRotateDimensions with data set #15
- testRotateDimensions with data set #16
- testRotateDimensions with data set #17
- testRotateDimensions with data set #18
- testRotateDimensions with data set #19
- testRotateDimensions with data set #20
- testRotateDimensions with data set #21
- testRotateDimensions with data set #22
- testRotateDimensions with data set #23
- testRotateDimensions with data set #24
- testRotateDimensions with data set #25
- testRotateDimensions with data set #26
- testRotateDimensions with data set #27
- testRotateDimensions with data set #28
- testRotateDimensions with data set #29
- testRotateDimensions with data set #30
- testRotateDimensions with data set #31
- testRotateDimensions with data set #32
- testRotateDimensions with data set #33
- testRotateDimensions with data set #34
- testRotateDimensions with data set #35
- testRotateDimensions with data set #36
- testRotateDimensions with data set #37
- testRotateDimensions with data set #38
- testRotateDimensions with data set #39
- testRotateDimensions with data set #40
- testRotateDimensions with data set #41
- testRotateDimensions with data set #42
- testRotateDimensions with data set #43
- testRotateDimensions with data set #44
- testRotateDimensions with data set #45
- testRotateDimensions with data set #46
- testRotateDimensions with data set #47
- testRotateDimensions with data set #48
- testRotateDimensions with data set #49
- testRotateDimensions with data set #50
- testRotateDimensions with data set #51
- testRotateDimensions with data set #52
- testRotateDimensions with data set #53
- testRotateDimensions with data set #54
- testRotateDimensions with data set #55
- testRotateDimensions with data set #56
- testRotateDimensions with data set #57
- testRotateDimensions with data set #58
- testRotateDimensions with data set #59
- testRotateDimensions with data set #60
- testRotateDimensions with data set #61
- testRotateDimensions with data set #62
- testRotateDimensions with data set #63
- testRotateDimensions with data set #64
- testRotateDimensions with data set #65
- testRotateDimensions with data set #66
- testRotateDimensions with data set #67
- testRotateDimensions with data set #68
- testRotateDimensions with data set #69
- testRotateDimensions with data set #70
- testRotateDimensions with data set #71
- testRotateDimensions with data set #72
- testRotateDimensions with data set #73
- testRotateDimensions with data set #74
- testRotateDimensions with data set #75
- testRotateDimensions with data set #76
- testRotateDimensions with data set #77
- testRotateDimensions with data set #78
- testRotateDimensions with data set #79
- testRotateDimensions with data set #80
- testRotateDimensions with data set #81
- testRotateDimensions with data set #82
- testRotateDimensions with data set #83
- testRotateDimensions with data set #84
- testRotateDimensions with data set #85
- testRotateDimensions with data set #86
- testRotateDimensions with data set #87
- testRotateDimensions with data set #88
- testRotateDimensions with data set #89
- testRotateDimensions with data set #90
- testRotateDimensions with data set #91
- testRotateDimensions with data set #92
- testRotateDimensions with data set #93
- testRotateDimensions with data set #94
- testRotateDimensions with data set #95
- testRotateDimensions with data set #96
- testRotateDimensions with data set #97
- testRotateDimensions with data set #98
- testRotateDimensions with data set #99
- testRotateDimensions with data set #100
- testRotateDimensions with data set #101
- testRotateDimensions with data set #102
- testRotateDimensions with data set #103
- testRotateDimensions with data set #104
- testRotateDimensions with data set #105
- testRotateDimensions with data set #106
- testRotateDimensions with data set #107
- testRotateDimensions with data set #108
- testRotateDimensions with data set #109
- testRotateDimensions with data set #110
- testRotateDimensions with data set #111
- testRotateDimensions with data set #112
- testRotateDimensions with data set #113
- testRotateDimensions with data set #114
- testRotateDimensions with data set #115
- testRotateDimensions with data set #116
- testRotateDimensions with data set #117
- testRotateDimensions with data set #118
- testRotateDimensions with data set #119
- testRotateDimensions with data set #120
- testRotateDimensions with data set #121
- testRotateDimensions with data set #122
- testRotateDimensions with data set #123
- testRotateDimensions with data set #124
- testRotateDimensions with data set #125
- testRotateDimensions with data set #126
- testRotateDimensions with data set #127
- testRotateDimensions with data set #128
- testRotateDimensions with data set #129
- testRotateDimensions with data set #130
- testRotateDimensions with data set #131
- testRotateDimensions with data set #132
- testRotateDimensions with data set #133
- testRotateDimensions with data set #134
- testRotateDimensions with data set #135
- testRotateDimensions with data set #136
- testRotateDimensions with data set #137
- testRotateDimensions with data set #138
- testRotateDimensions with data set #139
- testRotateDimensions with data set #140
- testRotateDimensions with data set #141
- testRotateDimensions with data set #142
- testRotateDimensions with data set #143
- testRotateDimensions with data set #144
- testRotateDimensions with data set #145
- testRotateDimensions with data set #146
- testRotateDimensions with data set #147
- testRotateDimensions with data set #148
- testRotateDimensions with data set #149
- testRotateDimensions with data set #150
- testRotateDimensions with data set #151
- testRotateDimensions with data set #152
- testRotateDimensions with data set #153
- testRotateDimensions with data set #154
- testRotateDimensions with data set #155
- testRotateDimensions with data set #156
- testRotateDimensions with data set #157
- testRotateDimensions with data set #158
- testRotateDimensions with data set #159
- testRotateDimensions with data set #160
- testRotateDimensions with data set #161
- testRotateDimensions with data set #162
- testRotateDimensions with data set #163
- testRotateDimensions with data set #164
- testRotateDimensions with data set #165
- testRotateDimensions with data set #166
- testRotateDimensions with data set #167
- testRotateDimensions with data set #168
- testRotateDimensions with data set #169
- testRotateDimensions with data set #170
- testRotateDimensions with data set #171
- testRotateDimensions with data set #172
- testRotateDimensions with data set #173
- testRotateDimensions with data set #174
- testRotateDimensions with data set #175
- testRotateDimensions with data set #176
- testRotateDimensions with data set #177
- testRotateDimensions with data set #178
- testRotateDimensions with data set #179
- testRotateDimensions with data set #180
- testRotateDimensions with data set #181
- testRotateDimensions with data set #182
- testRotateDimensions with data set #183
- testRotateDimensions with data set #184
- testRotateDimensions with data set #185
- testRotateDimensions with data set #186
- testRotateDimensions with data set #187
- testRotateDimensions with data set #188
- testRotateDimensions with data set #189
- testRotateDimensions with data set #190
- testRotateDimensions with data set #191
- testRotateDimensions with data set #192
- testRotateDimensions with data set #193
- testRotateDimensions with data set #194
- testRotateDimensions with data set #195
- testRotateDimensions with data set #196
- testRotateDimensions with data set #197
- testRotateDimensions with data set #198
- testRotateDimensions with data set #199
- testRotateDimensions with data set #200
- testRotateDimensions with data set #201
- testRotateDimensions with data set #202
- testRotateDimensions with data set #203
- testRotateDimensions with data set #204
- testRotateDimensions with data set #205
- testRotateDimensions with data set #206
- testRotateDimensions with data set #207
- testRotateDimensions with data set #208
- testRotateDimensions with data set #209
- testRotateDimensions with data set #210
- testRotateDimensions with data set #211
- testRotateDimensions with data set #212
- testRotateDimensions with data set #213
- testRotateDimensions with data set #214
- testRotateDimensions with data set #215
- testRotateDimensions with data set #216
- testRotateDimensions with data set #217
- testRotateDimensions with data set #218
- testRotateDimensions with data set #219
- testRotateDimensions with data set #220
- testRotateDimensions with data set #221
- testRotateDimensions with data set #222
- testRotateDimensions with data set #223
- testRotateDimensions with data set #224
- testRotateDimensions with data set #225
- testRotateDimensions with data set #226
- testRotateDimensions with data set #227
- testRotateDimensions with data set #228
- testRotateDimensions with data set #229
- testRotateDimensions with data set #230
- testRotateDimensions with data set #231
- testRotateDimensions with data set #232
- testRotateDimensions with data set #233
- testRotateDimensions with data set #234
- testRotateDimensions with data set #235
- testRotateDimensions with data set #236
- testRotateDimensions with data set #237
- testRotateDimensions with data set #238
- testRotateDimensions with data set #239
- testRotateDimensions with data set #240
- testRotateDimensions with data set #241
- testRotateDimensions with data set #242
- testRotateDimensions with data set #243
- testRotateDimensions with data set #244
- testRotateDimensions with data set #245
- testRotateDimensions with data set #246
- testRotateDimensions with data set #247
- testRotateDimensions with data set #248
- testRotateDimensions with data set #249
- testRotateDimensions with data set #250
- testRotateDimensions with data set #251
- testRotateDimensions with data set #252
- testRotateDimensions with data set #253
- testRotateDimensions with data set #254
- testRotateDimensions with data set #255
- testRotateDimensions with data set #256
- testRotateDimensions with data set #257
- testRotateDimensions with data set #258
- testRotateDimensions with data set #259
- testRotateDimensions with data set #260
- testRotateDimensions with data set #261
- testRotateDimensions with data set #262
- testRotateDimensions with data set #263
- testRotateDimensions with data set #264
- testRotateDimensions with data set #265
- testRotateDimensions with data set #266
- testRotateDimensions with data set #267
- testRotateDimensions with data set #268
- testRotateDimensions with data set #269
- testRotateDimensions with data set #270
- testRotateDimensions with data set #271
- testRotateDimensions with data set #272
- testRotateDimensions with data set #273
- testRotateDimensions with data set #274
- testRotateDimensions with data set #275
- testRotateDimensions with data set #276
- testRotateDimensions with data set #277
- testRotateDimensions with data set #278
- testRotateDimensions with data set #279
- testRotateDimensions with data set #280
- testRotateDimensions with data set #281
- testRotateDimensions with data set #282
- testRotateDimensions with data set #283
- testRotateDimensions with data set #284
- testRotateDimensions with data set #285
- testRotateDimensions with data set #286
- testRotateDimensions with data set #287
- testRotateDimensions with data set #288
- testRotateDimensions with data set #289
- testRotateDimensions with data set #290
- testRotateDimensions with data set #291
- testRotateDimensions with data set #292
- testRotateDimensions with data set #293
- testRotateDimensions with data set #294
- testRotateDimensions with data set #295
- testRotateDimensions with data set #296
- testRotateDimensions with data set #297
- testRotateDimensions with data set #298
- testRotateDimensions with data set #299
- testRotateDimensions with data set #300
- testRotateDimensions with data set #301
- testRotateDimensions with data set #302
- testRotateDimensions with data set #303
- testRotateDimensions with data set #304
- testRotateDimensions with data set #305
- testRotateDimensions with data set #306
- testRotateDimensions with data set #307
- testRotateDimensions with data set #308
- testRotateDimensions with data set #309
- testRotateDimensions with data set #310
- testRotateDimensions with data set #311
- testRotateDimensions with data set #312
- testRotateDimensions with data set #313
- testRotateDimensions with data set #314
- testRotateDimensions with data set #315
- testRotateDimensions with data set #316
- testRotateDimensions with data set #317
- testRotateDimensions with data set #318
- testRotateDimensions with data set #319
- testRotateDimensions with data set #320
- testRotateDimensions with data set #321
- testRotateDimensions with data set #322
- testRotateDimensions with data set #323
- testRotateDimensions with data set #324
- testRotateDimensions with data set #325
- testRotateDimensions with data set #326
- testRotateDimensions with data set #327
- testRotateDimensions with data set #328
- testRotateDimensions with data set #329
- testRotateDimensions with data set #330
- testRotateDimensions with data set #331
- testRotateDimensions with data set #332
- testRotateDimensions with data set #333
- testRotateDimensions with data set #334
- testRotateDimensions with data set #335
- testRotateDimensions with data set #336
- testRotateDimensions with data set #337
- testRotateDimensions with data set #338
- testRotateDimensions with data set #339
- testRotateDimensions with data set #340
- testRotateDimensions with data set #341
- testRotateDimensions with data set #342
- testRotateDimensions with data set #343
- testRotateDimensions with data set #344
- testRotateDimensions with data set #345
- testRotateDimensions with data set #346
- testRotateDimensions with data set #347
- testRotateDimensions with data set #348
- testRotateDimensions with data set #349
- testRotateDimensions with data set #350
- testRotateDimensions with data set #351
- testRotateDimensions with data set #352
- testRotateDimensions with data set #353
- testRotateDimensions with data set #354
- testRotateDimensions with data set #355
- testRotateDimensions with data set #356
- testRotateDimensions with data set #357
- testRotateDimensions with data set #358
- testRotateDimensions with data set #359
- testRotateDimensions with data set #360
- testRotateDimensions with data set #361
- testRotateDimensions with data set #362
- testRotateDimensions with data set #363
- testRotateDimensions with data set #364
- testRotateDimensions with data set #365
- testRotateDimensions with data set #366
- testRotateDimensions with data set #367
- testRotateDimensions with data set #368
- testRotateDimensions with data set #369
- testRotateDimensions with data set #370
- testRotateDimensions with data set #371
- testRotateDimensions with data set #372
- testRotateDimensions with data set #373
- testRotateDimensions with data set #374
- testRotateDimensions with data set #375
- testRotateDimensions with data set #376
- testRotateDimensions with data set #377
- testRotateDimensions with data set #378
- testRotateDimensions with data set #379
- testRotateDimensions with data set #380
- testRotateDimensions with data set #381
- testRotateDimensions with data set #382
- testRotateDimensions with data set #383
- testRotateDimensions with data set #384
- testRotateDimensions with data set #385
- testRotateDimensions with data set #386
- testRotateDimensions with data set #387
- testRotateDimensions with data set #388
- testRotateDimensions with data set #389
- testRotateDimensions with data set #390
- testRotateDimensions with data set #391
- testRotateDimensions with data set #392
- testRotateDimensions with data set #393
- testRotateDimensions with data set #394
- testRotateDimensions with data set #395
- testRotateDimensions with data set #396
- testRotateDimensions with data set #397
- testRotateDimensions with data set #398
- testRotateDimensions with data set #399
- testRotateDimensions with data set #400
- testRotateDimensions with data set #401
- testRotateDimensions with data set #402
- testRotateDimensions with data set #403
- testRotateDimensions with data set #404
- testRotateDimensions with data set #405
- testRotateDimensions with data set #406
- testRotateDimensions with data set #407
- testRotateDimensions with data set #408
- testRotateDimensions with data set #409
- testRotateDimensions with data set #410
- testRotateDimensions with data set #411
- testRotateDimensions with data set #412
- testRotateDimensions with data set #413
- testRotateDimensions with data set #414
- testRotateDimensions with data set #415
- testRotateDimensions with data set #416
- testRotateDimensions with data set #417
- testRotateDimensions with data set #418
- testRotateDimensions with data set #419
- testRotateDimensions with data set #420
- testRotateDimensions with data set #421
- testRotateDimensions with data set #422
- testRotateDimensions with data set #423
- testRotateDimensions with data set #424
- testRotateDimensions with data set #425
- testRotateDimensions with data set #426
- testRotateDimensions with data set #427
- testRotateDimensions with data set #428
- testRotateDimensions with data set #429
- testRotateDimensions with data set #430
- testRotateDimensions with data set #431
- testRotateDimensions with data set #432
- testRotateDimensions with data set #433
- testRotateDimensions with data set #434
- testRotateDimensions with data set #435
- testRotateDimensions with data set #436
- testRotateDimensions with data set #437
- testRotateDimensions with data set #438
- testRotateDimensions with data set #439
- testRotateDimensions with data set #440
- testRotateDimensions with data set #441
- testRotateDimensions with data set #442
- testRotateDimensions with data set #443
- testRotateDimensions with data set #444
- testRotateDimensions with data set #445
- testRotateDimensions with data set #446
- testRotateDimensions with data set #447
- testRotateDimensions with data set #448
- testRotateDimensions with data set #449
- testRotateDimensions with data set #450
- testRotateDimensions with data set #451
- testRotateDimensions with data set #452
- testRotateDimensions with data set #453
- testRotateDimensions with data set #454
- testRotateDimensions with data set #455
- testRotateDimensions with data set #456
- testRotateDimensions with data set #457
- testRotateDimensions with data set #458
- testRotateDimensions with data set #459
- testRotateDimensions with data set #460
- testRotateDimensions with data set #461
- testRotateDimensions with data set #462
- testRotateDimensions with data set #463
- testRotateDimensions with data set #464
- testRotateDimensions with data set #465
- testRotateDimensions with data set #466
- testRotateDimensions with data set #467
- testRotateDimensions with data set #468
- testRotateDimensions with data set #469
- testRotateDimensions with data set #470
- testRotateDimensions with data set #471
- testRotateDimensions with data set #472
- testRotateDimensions with data set #473
- testRotateDimensions with data set #474
- testRotateDimensions with data set #475
- testRotateDimensions with data set #476
- testRotateDimensions with data set #477
- testRotateDimensions with data set #478
- testRotateDimensions with data set #479
- testRotateDimensions with data set #480
- testRotateDimensions with data set #481
- testRotateDimensions with data set #482
- testRotateDimensions with data set #483
- testRotateDimensions with data set #484
- testRotateDimensions with data set #485
- testRotateDimensions with data set #486
- testRotateDimensions with data set #487
- testRotateDimensions with data set #488
- testRotateDimensions with data set #489
- testRotateDimensions with data set #490
- testRotateDimensions with data set #491
- testRotateDimensions with data set #492
- testRotateDimensions with data set #493
- testRotateDimensions with data set #494
- testRotateDimensions with data set #495
- testRotateDimensions with data set #496
- testRotateDimensions with data set #497
- testRotateDimensions with data set #498
- testRotateDimensions with data set #499
- testRotateDimensions with data set #500
- testRotateDimensions with data set #501
- testRotateDimensions with data set #502
- testRotateDimensions with data set #503
- testRotateDimensions with data set #504
- testRotateDimensions with data set #505
- testRotateDimensions with data set #506
- testRotateDimensions with data set #507
- testRotateDimensions with data set #508
- testRotateDimensions with data set #509
- testRotateDimensions with data set #510
- testRotateDimensions with data set #511
- testRotateDimensions with data set #512
- testRotateDimensions with data set #513
- testRotateDimensions with data set #514
- testRotateDimensions with data set #515
- testRotateDimensions with data set #516
- testRotateDimensions with data set #517
- testRotateDimensions with data set #518
- testRotateDimensions with data set #519
- testRotateDimensions with data set #520
- testRotateDimensions with data set #521
- testRotateDimensions with data set #522
- testRotateDimensions with data set #523
- testRotateDimensions with data set #524
- testRotateDimensions with data set #525
- testRotateDimensions with data set #526
- testRotateDimensions with data set #527
- testRotateDimensions with data set #528
- testRotateDimensions with data set #529
- testRotateDimensions with data set #530
- testRotateDimensions with data set #531
- testRotateDimensions with data set #532
- testRotateDimensions with data set #533
- testRotateDimensions with data set #534
- testRotateDimensions with data set #535
- testRotateDimensions with data set #536
- testRotateDimensions with data set #537
- testRotateDimensions with data set #538
- testRotateDimensions with data set #539
- testRotateDimensions with data set #540
- testRotateDimensions with data set #541
- testRotateDimensions with data set #542
- testRotateDimensions with data set #543
- testRotateDimensions with data set #544
- testRotateDimensions with data set #545
- testRotateDimensions with data set #546
- testRotateDimensions with data set #547
- testRotateDimensions with data set #548
- testRotateDimensions with data set #549
- testRotateDimensions with data set #550
- testRotateDimensions with data set #551
- testRotateDimensions with data set #552
- testRotateDimensions with data set #553
- testRotateDimensions with data set #554
- testRotateDimensions with data set #555
- testRotateDimensions with data set #556
- testRotateDimensions with data set #557
- testRotateDimensions with data set #558
- testRotateDimensions with data set #559
- testRotateDimensions with data set #560
- testRotateDimensions with data set #561
- testRotateDimensions with data set #562
- testRotateDimensions with data set #563
- testRotateDimensions with data set #564
- testRotateDimensions with data set #565
- testRotateDimensions with data set #566
- testRotateDimensions with data set #567
- testRotateDimensions with data set #568
- testRotateDimensions with data set #569
- testRotateDimensions with data set #570
- testRotateDimensions with data set #571
- testRotateDimensions with data set #572
- testRotateDimensions with data set #573
- testRotateDimensions with data set #574
- testRotateDimensions with data set #575
- testRotateDimensions with data set #576
- testRotateDimensions with data set #577
- testRotateDimensions with data set #578
- testRotateDimensions with data set #579
- testRotateDimensions with data set #580
- testRotateDimensions with data set #581
- testRotateDimensions with data set #582
- testRotateDimensions with data set #583
- testRotateDimensions with data set #584
- testRotateDimensions with data set #585
- testRotateDimensions with data set #586
- testRotateDimensions with data set #587
- testRotateDimensions with data set #588
- testRotateDimensions with data set #589
- testRotateDimensions with data set #590
- testRotateDimensions with data set #591
- testRotateDimensions with data set #592
- testRotateDimensions with data set #593
- testRotateDimensions with data set #594
- testRotateDimensions with data set #595
- testRotateDimensions with data set #596
- testRotateDimensions with data set #597
- testRotateDimensions with data set #598
- testRotateDimensions with data set #599
- testRotateDimensions with data set #600
- testRotateDimensions with data set #601
- testRotateDimensions with data set #602
- testRotateDimensions with data set #603
- testRotateDimensions with data set #604
- testRotateDimensions with data set #605
- testRotateDimensions with data set #606
- testRotateDimensions with data set #607
- testRotateDimensions with data set #608
- testRotateDimensions with data set #609
- testRotateDimensions with data set #610
- testRotateDimensions with data set #611
- testRotateDimensions with data set #612
- testRotateDimensions with data set #613
- testRotateDimensions with data set #614
- testRotateDimensions with data set #615
- testRotateDimensions with data set #616
- testRotateDimensions with data set #617
- testRotateDimensions with data set #618
- testRotateDimensions with data set #619
- testRotateDimensions with data set #620
- testRotateDimensions with data set #621
- testRotateDimensions with data set #622
- testRotateDimensions with data set #623
- testRotateDimensions with data set #624
- testRotateDimensions with data set #625
- testRotateDimensions with data set #626
- testRotateDimensions with data set #627
- testRotateDimensions with data set #628
- testRotateDimensions with data set #629
- testRotateDimensions with data set #630
- testRotateDimensions with data set #631
- testRotateDimensions with data set #632
- testRotateDimensions with data set #633
- testRotateDimensions with data set #634
- testRotateDimensions with data set #635
- testRotateDimensions with data set #636
- testRotateDimensions with data set #637
- testRotateDimensions with data set #638
- testRotateDimensions with data set #639
- testRotateDimensions with data set #640
- testRotateDimensions with data set #641
- testRotateDimensions with data set #642
- testRotateDimensions with data set #643
- testRotateDimensions with data set #644
- testRotateDimensions with data set #645
- testRotateDimensions with data set #646
- testRotateDimensions with data set #647
- testRotateDimensions with data set #648
- testRotateDimensions with data set #649
- testRotateDimensions with data set #650
- testRotateDimensions with data set #651
- testRotateDimensions with data set #652
- testRotateDimensions with data set #653
- testRotateDimensions with data set #654
- testRotateDimensions with data set #655
- testRotateDimensions with data set #656
- testRotateDimensions with data set #657
- testRotateDimensions with data set #658
- testRotateDimensions with data set #659
- testRotateDimensions with data set #660
- testRotateDimensions with data set #661
- testRotateDimensions with data set #662
- testRotateDimensions with data set #663
- testRotateDimensions with data set #664
- testRotateDimensions with data set #665
- testRotateDimensions with data set #666
- testRotateDimensions with data set #667
- testRotateDimensions with data set #668
- testRotateDimensions with data set #669
- testRotateDimensions with data set #670
- testRotateDimensions with data set #671
- testRotateDimensions with data set #672
- testRotateDimensions with data set #673
- testRotateDimensions with data set #674
- testRotateDimensions with data set #675
- testRotateDimensions with data set #676
- testRotateDimensions with data set #677
- testRotateDimensions with data set #678
- testRotateDimensions with data set #679
- testRotateDimensions with data set #680
- testRotateDimensions with data set #681
- testRotateDimensions with data set #682
- testRotateDimensions with data set #683
- testRotateDimensions with data set #684
- testRotateDimensions with data set #685
- testRotateDimensions with data set #686
- testRotateDimensions with data set #687
- testRotateDimensions with data set #688
- testRotateDimensions with data set #689
- testRotateDimensions with data set #690
- testRotateDimensions with data set #691
- testRotateDimensions with data set #692
- testRotateDimensions with data set #693
- testRotateDimensions with data set #694
- testRotateDimensions with data set #695
- testRotateDimensions with data set #696
- testRotateDimensions with data set #697
- testRotateDimensions with data set #698
- testRotateDimensions with data set #699
- testRotateDimensions with data set #700
- testRotateDimensions with data set #701
- testRotateDimensions with data set #702
- testRotateDimensions with data set #703
- testRotateDimensions with data set #704
- testRotateDimensions with data set #705
- testRotateDimensions with data set #706
- testRotateDimensions with data set #707
- testRotateDimensions with data set #708
- testRotateDimensions with data set #709
- testRotateDimensions with data set #710
- testRotateDimensions with data set #711
- testRotateDimensions with data set #712
- testRotateDimensions with data set #713
- testRotateDimensions with data set #714
- testRotateDimensions with data set #715
- testRotateDimensions with data set #716
- testRotateDimensions with data set #717
- testRotateDimensions with data set #718
- testRotateDimensions with data set #719
- testRotateDimensions with data set #720
- testRotateDimensions with data set #721
- testRotateDimensions with data set #722
- testRotateDimensions with data set #723
- testRotateDimensions with data set #724
- testRotateDimensions with data set #725
- testRotateDimensions with data set #726
- testRotateDimensions with data set #727
- testRotateDimensions with data set #728
- testRotateDimensions with data set #729
- testRotateDimensions with data set #730
- testRotateDimensions with data set #731
- testRotateDimensions with data set #732
- testRotateDimensions with data set #733
- testRotateDimensions with data set #734
- testRotateDimensions with data set #735
- testRotateDimensions with data set #736
- testRotateDimensions with data set #737
- testRotateDimensions with data set #738
- testRotateDimensions with data set #739
- testRotateDimensions with data set #740
- testRotateDimensions with data set #741
- testRotateDimensions with data set #742
- testRotateDimensions with data set #743
- testRotateDimensions with data set #744
- testRotateDimensions with data set #745
- testRotateDimensions with data set #746
- testRotateDimensions with data set #747
- testRotateDimensions with data set #748
- testRotateDimensions with data set #749
- testRotateDimensions with data set #750
- testRotateDimensions with data set #751
- testRotateDimensions with data set #752
- testRotateDimensions with data set #753
- testRotateDimensions with data set #754
- testRotateDimensions with data set #755
- testRotateDimensions with data set #756
- testRotateDimensions with data set #757
- testRotateDimensions with data set #758
- testRotateDimensions with data set #759
- testRotateDimensions with data set #760
- testRotateDimensions with data set #761
- testRotateDimensions with data set #762
- testRotateDimensions with data set #763
- testRotateDimensions with data set #764
- testRotateDimensions with data set #765
- testRotateDimensions with data set #766
- testRotateDimensions with data set #767
- testRotateDimensions with data set #768
- testRotateDimensions with data set #769
- testRotateDimensions with data set #770
- testRotateDimensions with data set #771
- testRotateDimensions with data set #772
- testRotateDimensions with data set #773
- testRotateDimensions with data set #774
- testRotateDimensions with data set #775
- testRotateDimensions with data set #776
- testRotateDimensions with data set #777
- testRotateDimensions with data set #778
- testRotateDimensions with data set #779
- testRotateDimensions with data set #780
- testRotateDimensions with data set #781
- testRotateDimensions with data set #782
- testRotateDimensions with data set #783
- testRotateDimensions with data set #784
- testRotateDimensions with data set #785
- testRotateDimensions with data set #786
- testRotateDimensions with data set #787
- testRotateDimensions with data set #788
- testRotateDimensions with data set #789
- testRotateDimensions with data set #790
- testRotateDimensions with data set #791
- testRotateDimensions with data set #792
- testRotateDimensions with data set #793
- testRotateDimensions with data set #794
- testRotateDimensions with data set #795
- testRotateDimensions with data set #796
- testRotateDimensions with data set #797
- testRotateDimensions with data set #798
- testRotateDimensions with data set #799
- testRotateDimensions with data set #800
- testRotateDimensions with data set #801
- testRotateDimensions with data set #802
- testRotateDimensions with data set #803
- testRotateDimensions with data set #804
- testRotateDimensions with data set #805
- testRotateDimensions with data set #806
- testRotateDimensions with data set #807
- testRotateDimensions with data set #808
- testRotateDimensions with data set #809
- testRotateDimensions with data set #810
- testRotateDimensions with data set #811
- testRotateDimensions with data set #812
- testRotateDimensions with data set #813
- testRotateDimensions with data set #814
- testRotateDimensions with data set #815
- testRotateDimensions with data set #816
- testRotateDimensions with data set #817
- testRotateDimensions with data set #818
- testRotateDimensions with data set #819
- testRotateDimensions with data set #820
- testRotateDimensions with data set #821
- testRotateDimensions with data set #822
- testRotateDimensions with data set #823
- testRotateDimensions with data set #824
- testRotateDimensions with data set #825
- testRotateDimensions with data set #826
- testRotateDimensions with data set #827
- testRotateDimensions with data set #828
- testRotateDimensions with data set #829
- testRotateDimensions with data set #830
- testRotateDimensions with data set #831
- testRotateDimensions with data set #832
- testRotateDimensions with data set #833
- testRotateDimensions with data set #834
- testRotateDimensions with data set #835
- testRotateDimensions with data set #836
- testRotateDimensions with data set #837
- testRotateDimensions with data set #838
- testRotateDimensions with data set #839
- testRotateDimensions with data set #840
- testRotateDimensions with data set #841
- testRotateDimensions with data set #842
- testRotateDimensions with data set #843
- testRotateDimensions with data set #844
- testRotateDimensions with data set #845
- testRotateDimensions with data set #846
- testRotateDimensions with data set #847
- testRotateDimensions with data set #848
- testRotateDimensions with data set #849
- testRotateDimensions with data set #850
- testRotateDimensions with data set #851
- testRotateDimensions with data set #852
- testRotateDimensions with data set #853
- testRotateDimensions with data set #854
- testRotateDimensions with data set #855
- testRotateDimensions with data set #856
- testRotateDimensions with data set #857
- testRotateDimensions with data set #858
- testRotateDimensions with data set #859
- testRotateDimensions with data set #860
- testRotateDimensions with data set #861
- testRotateDimensions with data set #862
- testRotateDimensions with data set #863
- testRotateDimensions with data set #864
- testRotateDimensions with data set #865
- testRotateDimensions with data set #866
- testRotateDimensions with data set #867
- testRotateDimensions with data set #868
- testRotateDimensions with data set #869
- testRotateDimensions with data set #870
- testRotateDimensions with data set #871
- testRotateDimensions with data set #872
- testRotateDimensions with data set #873
- testRotateDimensions with data set #874
- testRotateDimensions with data set #875
- testRotateDimensions with data set #876
- testRotateDimensions with data set #877
- testRotateDimensions with data set #878
- testRotateDimensions with data set #879
- testRotateDimensions with data set #880
- testRotateDimensions with data set #881
- testRotateDimensions with data set #882
- testRotateDimensions with data set #883
- testRotateDimensions with data set #884
- testRotateDimensions with data set #885
- testRotateDimensions with data set #886
- testRotateDimensions with data set #887
- testRotateDimensions with data set #888
- testRotateDimensions with data set #889
- testRotateDimensions with data set #890
- testRotateDimensions with data set #891
- testRotateDimensions with data set #892
- testRotateDimensions with data set #893
- testRotateDimensions with data set #894
- testRotateDimensions with data set #895
- testRotateDimensions with data set #896
- testRotateDimensions with data set #897
- testRotateDimensions with data set #898
- testRotateDimensions with data set #